{"text_format":"1","workbook":"xlsx","n_sheets":34,"sheets":["Vejledning","Medarbejder 1","Medarbejder 2","Medarbejder 3","Medarbejder 4","Medarbejder 5","Medarbejder 6","Medarbejder 7","Medarbejder 8","Medarbejder 9","Medarbejder 10","Medarbejder 11","Medarbejder 12","Medarbejder 13","Medarbejder 14","Medarbejder 15","Medarbejder 16","Medarbejder 17","Medarbejder 18","Medarbejder 19","Medarbejder 20","Medarbejder 21","Medarbejder 22","Medarbejder 23","Medarbejder 24","Medarbejder 25","Medarbejder 26","Medarbejder 27","Medarbejder 28","Medarbejder 29","Medarbejder 30","Budget","Format ark","Slutregnskab"],"not_rendered":{"charts":0,"images":0,"macros":1,"external_links":1,"defined_names":2,"comments":0,"pivot_tables":0},"unopened":[],"bounds":{"document_bytes":16777216,"sheet_cells":100000,"rows_first":2000,"rows_last":500,"rows_between":2000,"halvings":0,"cell_chars":16384,"cell_head_chars":4096},"cells_cut":0,"cells_raw":0,"read":"whole","date_system":"1900"}

{"sheet":"Vejledning","index":0,"n_rows":25,"n_cols":17,"rows_kept":25,"cut":false,"hidden":false,"merged":[]}
[]
[]
[]
[]
[]
[]
[]
[]
[]
[]
[]
[]
[]
[]
[null,null,null,null,null,null,null,null,null,null,"CVR-nummer",null,null,null,{"$f":"LEN(P15)","v":0}]
[]
[null,null,null,null,null,null,null,null,null,null,"Branchekode",null,null,null,{"$f":"LEN(P17)","v":0}]
[]
[null,null,null,null,null,null,null,null,null,null,"P-nummer",null,null,null,0]
[]
[null,null,null,null,null,null,null,null,null,null,"Hvor mange ansatte er der i virksomheden?",null,null,null,null,null,{"$f":"IF(P21=\"\",\"Husk at angive det samlede antal medarbejder i virksomheden\",\" \")","v":"Husk at angive det samlede antal medarbejder i virksomheden"}]
[]
[null,null,null,null,null,null,null,null,null,null,"Antal tilladte sporskiftepakker",null,null,null,null,{"$f":"IF(0<P21,2,0)+IF(9<P21,3)+IF(49<P21,5)+IF(99<P21,10)+IF(249<P21,10)","v":0}]
[]
[null,null,null,null,null,null,null,null,null,null,"Projektperioden løber i år:",null,null,null,null,2022]

{"sheet":"Medarbejder 1","index":1,"n_rows":61,"n_cols":6,"rows_kept":61,"cut":false,"hidden":true,"merged":[[55,1,56,2],[55,3,56,3],[60,5,60,6],[35,1,35,2],[36,1,36,2],[37,1,37,2],[38,1,38,2],[39,1,39,2],[34,1,34,2],[27,1,27,2],[28,1,28,2],[29,1,29,2],[30,1,30,2],[31,1,31,2],[32,1,32,2],[33,1,33,2],[8,4,8,5],[6,1,6,2],[8,1,8,2],[7,1,7,2],[21,1,21,2],[9,1,9,2],[9,4,9,5],[10,1,10,2],[11,1,11,3],[12,1,12,3],[16,1,16,2],[17,1,17,2],[18,1,18,2],[19,1,19,2],[20,1,20,2]]}
[]
[null,null,"Budget/Regnskab for sporskiftepakken"]
[]
[null,null,"Oplysninger om medarbejderen"]
[]
[null,null,"Medarbejder 1"]
[null,"Medarbejderens lønkompensation fra sporskifte (kr./t.)",null,{"$f":"IF(D8>261,(IF(D11=\"Ja\",260-'Format ark'!D13,260)),IF(D8<=260,IF(D11=\"Ja\",IF(D8<'Format ark'!D13,0,D8-'Format ark'!D13),D8)))","v":0}]
[null,"Medarbejderens timesats (kr./t.)"]
[null,"Medarbejderens højst gennemførte uddannelse",null,null,{"$f":"IF(D9=\"\",\"Husk at vælge medarbejderens højst gennemførte uddannelse.\",\" \")","v":"Husk at vælge medarbejderens højst gennemførte uddannelse."}]
[null,"Har medarbejderen brugt sin uddannelse de senest 5 år?",null,null,{"$f":"IF(D10=\"\",\"Husk at svare på spørgsmålet.\",\" \")","v":"Husk at svare på spørgsmålet."}]
[null,"Medarbejder formodes at være berettiget til at få VEU-godtgørelse ",null,{"$f":"IF(OR(D9=\"Videregående uddannelse\",D9=\"Gymnasial uddannelse\")*AND(D10=\"ja\"),\"Nej\",\"Ja\")","v":"Ja"}]
[null,"Beskriv herunder hvad formålet med den planlagte sporskiftepakke er for medarbejderen:"]
[]
[]
[null,null,"Aktiviteter"]
[]
[null,"Afklaring, vejledning mv. \nSkriv navn på kursus",null,"Medarbejderens timeforbug (timer)","Evt. deltagerbetaling (kr.)","Giver kurset ret til VEU-godtgørelse?"]
[]
[]
[]
[]
[]
[null,"Samlet antal timer (udregner selv)",null,{"$f":"SUM(D18:D22)","v":0}]
[null,"Samlet lønkompensation udover evt. VEU-godtgørelse (udregner selv)",null,{"$f":"IF(D11=\"Nej\",D23*D7,0)+IF(AND(D11=\"Ja\",F18=\"Ja\"),D18*D7,0)+IF(AND(D11=\"Ja\",F19=\"Ja\"),D19*D7,0)+IF(AND(D11=\"Ja\",F20=\"Ja\"),D20*D7,0)+IF(AND(D11=\"Ja\",F21=\"Ja\"),D21*D7,0)+IF(AND(D11=\"Ja\",F22=\"Ja\"),D22*D7,0)+IF(AND(D11=\"Ja\",F18=\"Nej\"),D18*IF(D8>261,(IF(F18=\"Ja\",260-'Format ark'!D13,260)),IF(D8<=260,IF(F18=\"Ja\",D8-'Format ark'!D13,D8))),0)+IF(AND(D11=\"Ja\",F19=\"Nej\"),D19*IF(D8>261,(IF(F19=\"Ja\",260-'Format ark'!D13,260)),IF(D8<=260,IF(F19=\"Ja\",D8-'Format ark'!D13,D8))),0)+IF(AND(D11=\"Ja\",F20=\"Nej\"),D20*IF(D8>261,(IF(F20=\"Ja\",260-'Format ark'!D13,260)),IF(D8<=260,IF(F20=\"Ja\",D8-'Format ark'!D13,D8))),0)+IF(AND(D11=\"Ja\",F21=\"Nej\"),D21*IF(D8>261,(IF(F21=\"Ja\",260-'Format ark'!D13,260)),IF(D8<=260,IF(F21=\"Ja\",D8-'Format ark'!D13,D8))),0)+IF(AND(D11=\"Ja\",F22=\"Nej\"),D22*IF(D8>261,(IF(F22=\"Ja\",260-'Format ark'!D13,260)),IF(D8<=260,IF(F22=\"Ja\",D8-'Format ark'!D13,D8))),0)","v":0}]
[null,"Estimeret VEU-godtgørelse",null,{"$f":"IF(AND(D11=\"Ja\",F18=\"Ja\"),D18*'Format ark'!D13,0)+IF(AND(D11=\"Ja\",F19=\"Ja\"),D19*'Format ark'!D13,0)+IF(AND(D11=\"Ja\",F20=\"Ja\"),D20*'Format ark'!D13,0)+IF(AND(D11=\"Ja\",F21=\"Ja\"),D21*'Format ark'!D13,0)+IF(AND(D11=\"Ja\",F22=\"Ja\"),D22*'Format ark'!D13,0)","v":0}]
[null,"Samlet deltagerbeltaing (udregner selv)",null,{"$f":"SUM(E18:E22)","v":0}]
[]
[null,"Erhversrettet efteruddannelse\nSkriv navn på efteruddannelse",null,"Medarbejderens timeforbrug (timer)","Evt. deltagerbetaling (kr.)","Giver kurset ret til VEU-godtgørelse?"]
[]
[]
[]
[]
[]
[]
[]
[]
[]
[]
[]
[null,"Kørsel/transport (angives som faktisk udgift)"]
[null,"Samlet antal timer (udregner selv)",null,{"$f":"SUM(D29:D40)","v":0}]
[null,"Samlet lønkompensation udover evt. VEU-godtgørelse (udregner selv)",null,{"$f":"IF(D11=\"Nej\",D41*D7,0)+IF(AND(D11=\"Ja\",F29=\"Ja\"),D29*D7,0)+IF(AND(D11=\"Ja\",F30=\"Ja\"),D30*D7,0)+IF(AND(D11=\"Ja\",F31=\"Ja\"),D31*D7,0)+IF(AND(D11=\"Ja\",F32=\"Ja\"),D32*D7,0)+IF(AND(D11=\"Ja\",F33=\"Ja\"),D33*D7,0)+IF(AND(D11=\"Ja\",F34=\"Ja\"),D34*D7,0)+IF(AND(D11=\"Ja\",F35=\"Ja\"),D35*D7,0)+IF(AND(D11=\"Ja\",F36=\"Ja\"),D36*D7,0)+IF(AND(D11=\"Ja\",F37=\"Ja\"),D37*D7,0)+IF(AND(D11=\"Ja\",F38=\"Ja\"),D38*D7,0)+IF(AND(D11=\"Ja\",F39=\"Ja\"),D39*D7,0)+IF(AND(D11=\"Ja\",F40=\"Ja\"),D40*D7,0)+IF(AND(D11=\"Ja\",F29=\"Nej\"),D29* IF(D8>261,(IF(F29=\"Ja\",260-'Format ark'!D13,260)),IF(D8<=260,IF(F29=\"Ja\",D8-'Format ark'!D13,D8))),0)+IF(AND(D11=\"Ja\",F30=\"Nej\"),D30* IF(D8>261,(IF(F30=\"Ja\",260-'Format ark'!D13,260)),IF(D8<=260,IF(F30=\"Ja\",D8-'Format ark'!D13,D8))),0)+IF(AND(D11=\"Ja\",F31=\"Nej\"),D31* IF(D8>261,(IF(F31=\"Ja\",260-'Format ark'!D13,260)),IF(D8<=260,IF(F31=\"Ja\",D8-'Format ark'!D13,D8))),0)+IF(AND(D11=\"Ja\",F32=\"Nej\"),D32* IF(D8>261,(IF(F32=\"Ja\",260-'Format ark'!D13,260)),IF(D8<=260,IF(F32=\"Ja\",D8-'Format ark'!D13,D8))),0)+IF(AND(D11=\"Ja\",F33=\"Nej\"),D33* IF(D8>261,(IF(F33=\"Ja\",260-'Format ark'!D13,260)),IF(D8<=260,IF(F33=\"Ja\",D8-'Format ark'!D13,D8))),0)+IF(AND(D11=\"Ja\",F34=\"Nej\"),D34* IF(D8>261,(IF(F34=\"Ja\",260-'Format ark'!D13,260)),IF(D8<=260,IF(F34=\"Ja\",D8-'Format ark'!D13,D8))),0)+IF(AND(D11=\"Ja\",F35=\"Nej\"),D35* IF(D8>261,(IF(F35=\"Ja\",260-'Format ark'!D13,260)),IF(D8<=260,IF(F35=\"Ja\",D8-'Format ark'!D13,D8))),0)+IF(AND(D11=\"Ja\",F36=\"Nej\"),D36* IF(D8>261,(IF(F36=\"Ja\",260-'Format ark'!D13,260)),IF(D8<=260,IF(F36=\"Ja\",D8-'Format ark'!D13,D8))),0)+IF(AND(D11=\"Ja\",F37=\"Nej\"),D37* IF(D8>261,(IF(F37=\"Ja\",260-'Format ark'!D13,260)),IF(D8<=260,IF(F37=\"Ja\",D8-'Format ark'!D13,D8))),0)+IF(AND(D11=\"Ja\",F38=\"Nej\"),D38* IF(D8>261,(IF(F38=\"Ja\",260-'Format ark'!D13,260)),IF(D8<=260,IF(F38=\"Ja\",D8-'Format ark'!D13,D8))),0)+IF(AND(D11=\"Ja\",F39=\"Nej\"),D39* IF(D8>261,(IF(F39=\"Ja\",260-'Format ark'!D13,260)),IF(D8<=260,IF(F39=\"Ja\",D8-'Format ark'!D13,D8))),0)+IF(AND(D11=\"Ja\",F40=\"Nej\"),D40* IF(D8>261,(IF(F40=\"Ja\",260-'Format ark'!D13,260)),IF(D8<=260,IF(F40=\"Ja\",D8-'Format ark'!D13,D8))),0)","v":0}]
[null,"Estimeret VEU-godtgørelse",null,{"$f":"IF(AND(D11=\"Ja\",F29=\"Ja\"),D29*'Format ark'!D13,0)+IF(AND(D11=\"Ja\",F30=\"Ja\"),D30*'Format ark'!D13,0)+IF(AND(D11=\"Ja\",F31=\"Ja\"),D31*'Format ark'!D13,0)+IF(AND(D11=\"Ja\",F32=\"Ja\"),D32*('Format ark'!D13),0)+IF(AND(D11=\"Ja\",F33=\"Ja\"),D33*'Format ark'!D13,0)+IF(AND(D11=\"Ja\",F34=\"Ja\"),D34*'Format ark'!D13,0)+IF(AND(D11=\"Ja\",F35=\"Ja\"),D35*'Format ark'!D13,0)+IF(AND(D11=\"Ja\",F36=\"Ja\"),D36*'Format ark'!D13,0)+IF(AND(D11=\"Ja\",F37=\"Ja\"),D37*'Format ark'!D13,0)+IF(AND(D11=\"Ja\",F38=\"Ja\"),D38*'Format ark'!D13,0)+IF(AND(D11=\"Ja\",F39=\"Ja\"),D39*'Format ark'!D13,0)+IF(AND(D11=\"Ja\",F40=\"Ja\"),D40*'Format ark'!D13,0)","v":0}]
[null,"Samlet deltagerbetaling (udregner selv)",null,{"$f":"SUM(E29:E40)","v":0}]
[]
[null,"Praktik"]
[null,"Navn på virksomhed og p-nummer"]
[null,"Medarbejderens timeforbrug",null,null,{"$f":"IF(D48>C51*0.5,\"Praktik må maksimalt udgøre 50% af det samlede tidsforbrug.\",\" \")","v":" "}]
[null,"Samlet lønkompensation for praktikopholdet",null,{"$f":"IF(D48>C51*0.5,\"IKKE MULIGT\",D48*(IF(D8>261,260,D8)))","v":0}]
[]
[null,"Samlet tidsforbrug ",{"$f":"IF(D48+D41+D23>300,\"IKKE MULIGT\",D48+D41+D23)","v":0},{"$f":"IF(C51>300,\"Det maksimale tidsforbrug er 300 timer\",\" \")","v":" "}]
[]
[null,"Tidsforbrug til administration","Antal timer","Beløb"]
[null,"Der kan godtgøres op til 5 timer.",null,{"$f":"IF(C54>5,\"Der kan maksimalt godtgøres 5 timer pr. medarbejder.\",C54*260)","v":0}]
[]
[null,"Samlet tilsagnsramme i kr. (maksimal støtte til sporskiftepakken): ",null,{"$f":"IF(C51>300,0,MIN(D49+D44+D42+D26+D24+D54,120000))","v":0},{"$f":"IF(D56=120000,\"Det maksimale tilsagn pr. sporskiftepakke er nået, og det overstigende beløb er derfor selvbetaling.\",\"\")","v":""}]
[]
[]
[null,"Estimeret VEU-godtgørelse",null,{"$f":"D43+D25","v":0}]
[]
[null,"Selvbetaling i kr. (udgifter udover den øvre tilsagnsramme)",null,{"$f":"IF(C51>300,0,IF(D56=120000,D44+D26+D42+D49+D24+D54-120000,0))","v":0}]

{"sheet":"Medarbejder 2","index":2,"n_rows":61,"n_cols":6,"rows_kept":61,"cut":false,"hidden":true,"merged":[[6,1,6,2],[8,1,8,2],[7,1,7,2],[55,1,56,2],[8,4,8,5],[21,1,21,2],[9,1,9,2],[9,4,9,5],[10,1,10,2],[11,1,11,3],[12,1,12,3],[17,1,17,2],[18,1,18,2],[19,1,19,2],[20,1,20,2],[55,3,56,3],[16,1,16,2],[33,1,33,2],[34,1,34,2],[27,1,27,2],[28,1,28,2],[29,1,29,2],[30,1,30,2],[31,1,31,2],[32,1,32,2],[35,1,35,2],[36,1,36,2],[37,1,37,2],[38,1,38,2],[39,1,39,2]]}
[{"$f":"Vejledning!P21","v":0}]
[null,null,"Budget/Regnskab for sporskiftepakken"]
[]
[null,null,"Oplysninger om medarbejderen"]
[]
[null,null,"Medarbejder 2"]
[null,"Medarbejderens lønkompensation fra sporskifte (kr./t.)",null,{"$f":"IF(D8>261,(IF(D11=\"Ja\",260-'Format ark'!D13,260)),IF(D8<=260,IF(D11=\"Ja\",IF(D8<'Format ark'!D13,0,D8-'Format ark'!D13),D8)))","v":0}]
[null,"Medarbejderens timesats (kr./t.)"]
[null,"Medarbejderens højst gennemførte uddannelse",null,null,{"$f":"IF(D9=\"\",\"Husk at vælge medarbejderens højst gennemførte uddannelse.\",\" \")","v":"Husk at vælge medarbejderens højst gennemførte uddannelse."}]
[null,"Har medarbejderen brugt sin uddannelse de senest 5 år?",null,null,{"$f":"IF(D10=\"\",\"Husk at svare på spørgsmålet.\",\" \")","v":"Husk at svare på spørgsmålet."}]
[null,"Medarbejder formodes at være berettiget til at få VEU-godtgørelse ",null,{"$f":"IF(OR(D9=\"Videregående uddannelse\",D9=\"Gymnasial uddannelse\")*AND(D10=\"ja\"),\"Nej\",\"Ja\")","v":"Ja"}]
[null,"Beskriv herunder hvad formålet med den planlagte sporskiftepakke er for medarbejderen:"]
[]
[]
[null,null,"Aktiviteter"]
[]
[null,"Afklaring, vejledning mv. \nSkriv navn på kursus",null,"Medarbejderens timeforbug (timer)","Evt. deltagerbetaling (kr.)","Giver kurset ret til VEU-godtgørelse?"]
[]
[]
[]
[]
[]
[null,"Samlet antal timer (udregner selv)",null,{"$f":"SUM(D18:D22)","v":0}]
[null,"Samlet lønkompensation udover evt. VEU-godtgørelse (udregner selv)",null,{"$f":"IF(D11=\"Nej\",D23*D7,0)+IF(AND(D11=\"Ja\",F18=\"Ja\"),D18*D7,0)+IF(AND(D11=\"Ja\",F19=\"Ja\"),D19*D7,0)+IF(AND(D11=\"Ja\",F20=\"Ja\"),D20*D7,0)+IF(AND(D11=\"Ja\",F21=\"Ja\"),D21*D7,0)+IF(AND(D11=\"Ja\",F22=\"Ja\"),D22*D7,0)+IF(AND(D11=\"Ja\",F18=\"Nej\"),D18*IF(D8>261,(IF(F18=\"Ja\",260-'Format ark'!D13,260)),IF(D8<=260,IF(F18=\"Ja\",D8-'Format ark'!D13,D8))),0)+IF(AND(D11=\"Ja\",F19=\"Nej\"),D19*IF(D8>261,(IF(F19=\"Ja\",260-'Format ark'!D13,260)),IF(D8<=260,IF(F19=\"Ja\",D8-'Format ark'!D13,D8))),0)+IF(AND(D11=\"Ja\",F20=\"Nej\"),D20*IF(D8>261,(IF(F20=\"Ja\",260-'Format ark'!D13,260)),IF(D8<=260,IF(F20=\"Ja\",D8-'Format ark'!D13,D8))),0)+IF(AND(D11=\"Ja\",F21=\"Nej\"),D21*IF(D8>261,(IF(F21=\"Ja\",260-'Format ark'!D13,260)),IF(D8<=260,IF(F21=\"Ja\",D8-'Format ark'!D13,D8))),0)+IF(AND(D11=\"Ja\",F22=\"Nej\"),D22*IF(D8>261,(IF(F22=\"Ja\",260-'Format ark'!D13,260)),IF(D8<=260,IF(F22=\"Ja\",D8-'Format ark'!D13,D8))),0)","v":0}]
[null,"Estimeret VEU-godtgørelse",null,{"$f":"IF(AND(D11=\"Ja\",F18=\"Ja\"),D18*'Format ark'!D13,0)+IF(AND(D11=\"Ja\",F19=\"Ja\"),D19*'Format ark'!D13,0)+IF(AND(D11=\"Ja\",F20=\"Ja\"),D20*'Format ark'!D13,0)+IF(AND(D11=\"Ja\",F21=\"Ja\"),D21*'Format ark'!D13,0)+IF(AND(D11=\"Ja\",F22=\"Ja\"),D22*'Format ark'!D13,0)","v":0}]
[null,"Samlet deltagerbeltaing (udregner selv)",null,{"$f":"SUM(E18:E22)","v":0}]
[]
[null,"Erhversrettet efteruddannelse\nSkriv navn på efteruddannelse",null,"Medarbejderens timeforbrug (timer)","Evt. deltagerbetaling (kr.)","Giver kurset ret til VEU-godtgørelse?"]
[]
[]
[]
[]
[]
[]
[]
[]
[]
[]
[]
[null,"Kørsel/transport (angives som faktisk udgift)"]
[null,"Samlet antal timer (udregner selv)",null,{"$f":"SUM(D29:D40)","v":0}]
[null,"Samlet lønkompensation udover evt. VEU-godtgørelse (udregner selv)",null,{"$f":"IF(D11=\"Nej\",D41*D7,0)+IF(AND(D11=\"Ja\",F29=\"Ja\"),D29*D7,0)+IF(AND(D11=\"Ja\",F30=\"Ja\"),D30*D7,0)+IF(AND(D11=\"Ja\",F31=\"Ja\"),D31*D7,0)+IF(AND(D11=\"Ja\",F32=\"Ja\"),D32*D7,0)+IF(AND(D11=\"Ja\",F33=\"Ja\"),D33*D7,0)+IF(AND(D11=\"Ja\",F34=\"Ja\"),D34*D7,0)+IF(AND(D11=\"Ja\",F35=\"Ja\"),D35*D7,0)+IF(AND(D11=\"Ja\",F36=\"Ja\"),D36*D7,0)+IF(AND(D11=\"Ja\",F37=\"Ja\"),D37*D7,0)+IF(AND(D11=\"Ja\",F38=\"Ja\"),D38*D7,0)+IF(AND(D11=\"Ja\",F39=\"Ja\"),D39*D7,0)+IF(AND(D11=\"Ja\",F40=\"Ja\"),D40*D7,0)+IF(AND(D11=\"Ja\",F29=\"Nej\"),D29* IF(D8>261,(IF(F29=\"Ja\",260-'Format ark'!D13,260)),IF(D8<=260,IF(F29=\"Ja\",D8-'Format ark'!D13,D8))),0)+IF(AND(D11=\"Ja\",F30=\"Nej\"),D30* IF(D8>261,(IF(F30=\"Ja\",260-'Format ark'!D13,260)),IF(D8<=260,IF(F30=\"Ja\",D8-'Format ark'!D13,D8))),0)+IF(AND(D11=\"Ja\",F31=\"Nej\"),D31* IF(D8>261,(IF(F31=\"Ja\",260-'Format ark'!D13,260)),IF(D8<=260,IF(F31=\"Ja\",D8-'Format ark'!D13,D8))),0)+IF(AND(D11=\"Ja\",F32=\"Nej\"),D32* IF(D8>261,(IF(F32=\"Ja\",260-'Format ark'!D13,260)),IF(D8<=260,IF(F32=\"Ja\",D8-'Format ark'!D13,D8))),0)+IF(AND(D11=\"Ja\",F33=\"Nej\"),D33* IF(D8>261,(IF(F33=\"Ja\",260-'Format ark'!D13,260)),IF(D8<=260,IF(F33=\"Ja\",D8-'Format ark'!D13,D8))),0)+IF(AND(D11=\"Ja\",F34=\"Nej\"),D34* IF(D8>261,(IF(F34=\"Ja\",260-'Format ark'!D13,260)),IF(D8<=260,IF(F34=\"Ja\",D8-'Format ark'!D13,D8))),0)+IF(AND(D11=\"Ja\",F35=\"Nej\"),D35* IF(D8>261,(IF(F35=\"Ja\",260-'Format ark'!D13,260)),IF(D8<=260,IF(F35=\"Ja\",D8-'Format ark'!D13,D8))),0)+IF(AND(D11=\"Ja\",F36=\"Nej\"),D36* IF(D8>261,(IF(F36=\"Ja\",260-'Format ark'!D13,260)),IF(D8<=260,IF(F36=\"Ja\",D8-'Format ark'!D13,D8))),0)+IF(AND(D11=\"Ja\",F37=\"Nej\"),D37* IF(D8>261,(IF(F37=\"Ja\",260-'Format ark'!D13,260)),IF(D8<=260,IF(F37=\"Ja\",D8-'Format ark'!D13,D8))),0)+IF(AND(D11=\"Ja\",F38=\"Nej\"),D38* IF(D8>261,(IF(F38=\"Ja\",260-'Format ark'!D13,260)),IF(D8<=260,IF(F38=\"Ja\",D8-'Format ark'!D13,D8))),0)+IF(AND(D11=\"Ja\",F39=\"Nej\"),D39* IF(D8>261,(IF(F39=\"Ja\",260-'Format ark'!D13,260)),IF(D8<=260,IF(F39=\"Ja\",D8-'Format ark'!D13,D8))),0)+IF(AND(D11=\"Ja\",F40=\"Nej\"),D40* IF(D8>261,(IF(F40=\"Ja\",260-'Format ark'!D13,260)),IF(D8<=260,IF(F40=\"Ja\",D8-'Format ark'!D13,D8))),0)","v":0}]
[null,"Estimeret VEU-godtgørelse",null,{"$f":"IF(AND(D11=\"Ja\",F29=\"Ja\"),D29*'Format ark'!D13,0)+IF(AND(D11=\"Ja\",F30=\"Ja\"),D30*'Format ark'!D13,0)+IF(AND(D11=\"Ja\",F31=\"Ja\"),D31*'Format ark'!D13,0)+IF(AND(D11=\"Ja\",F32=\"Ja\"),D32*('Format ark'!D13),0)+IF(AND(D11=\"Ja\",F33=\"Ja\"),D33*'Format ark'!D13,0)+IF(AND(D11=\"Ja\",F34=\"Ja\"),D34*'Format ark'!D13,0)+IF(AND(D11=\"Ja\",F35=\"Ja\"),D35*'Format ark'!D13,0)+IF(AND(D11=\"Ja\",F36=\"Ja\"),D36*'Format ark'!D13,0)+IF(AND(D11=\"Ja\",F37=\"Ja\"),D37*'Format ark'!D13,0)+IF(AND(D11=\"Ja\",F38=\"Ja\"),D38*'Format ark'!D13,0)+IF(AND(D11=\"Ja\",F39=\"Ja\"),D39*'Format ark'!D13,0)+IF(AND(D11=\"Ja\",F40=\"Ja\"),D40*'Format ark'!D13,0)","v":0}]
[null,"Samlet deltagerbetaling (udregner selv)",null,{"$f":"SUM(E29:E40)","v":0}]
[]
[null,"Praktik"]
[null,"Navn på virksomhed og p-nummer"]
[null,"Medarbejderens timeforbrug",null,null,{"$f":"IF(D48>C51*0.5,\"Praktik må maksimalt udgøre 50% af det samlede tidsforbrug.\",\" \")","v":" "}]
[null,"Samlet lønkompensation for praktikopholdet",null,{"$f":"IF(D48>C51*0.5,\"IKKE MULIGT\",D48*(IF(D8>261,260,D8)))","v":0}]
[]
[null,"Samlet tidsforbrug ",{"$f":"IF(D48+D41+D23>300,\"IKKE MULIGT\",D48+D41+D23)","v":0},{"$f":"IF(C51>300,\"Det maksimale tidsforbrug er 300 timer\",\" \")","v":" "}]
[]
[null,"Tidsforbrug til administration","Antal timer","Beløb"]
[null,"Der kan godtgøres op til 5 timer.",null,{"$f":"IF(C54>5,\"Der kan maksimalt godtgøres 5 timer pr. medarbejder.\",C54*260)","v":0}]
[]
[null,"Samlet tilsagnsramme i kr. (maksimal støtte til sporskiftepakken): ",null,{"$f":"IF(C51>300,0,MIN(D49+D44+D42+D26+D24+D54,120000))","v":0},{"$f":"IF(D56=120000,\"Det maksimale tilsagn pr. sporskiftepakke er nået, og det overstigende beløb er derfor selvbetaling.\",\"\")","v":""}]
[]
[]
[null,"Estimeret VEU-godtgørelse",null,{"$f":"D43+D25","v":0}]
[]
[null,"Selvbetaling i kr. (udgifter udover den øvre tilsagnsramme)",null,{"$f":"IF(C51>300,0,IF(D56=120000,D44+D26+D42+D49+D24+D54-120000,0))","v":0}]

{"sheet":"Medarbejder 3","index":3,"n_rows":61,"n_cols":6,"rows_kept":61,"cut":false,"hidden":true,"merged":[[6,1,6,2],[8,1,8,2],[7,1,7,2],[55,1,56,2],[8,4,8,5],[21,1,21,2],[9,1,9,2],[9,4,9,5],[10,1,10,2],[11,1,11,3],[12,1,12,3],[17,1,17,2],[18,1,18,2],[19,1,19,2],[20,1,20,2],[55,3,56,3],[16,1,16,2],[33,1,33,2],[34,1,34,2],[27,1,27,2],[28,1,28,2],[29,1,29,2],[30,1,30,2],[31,1,31,2],[32,1,32,2],[35,1,35,2],[36,1,36,2],[37,1,37,2],[38,1,38,2],[39,1,39,2]]}
[]
[null,null,"Budget/Regnskab for sporskiftepakken"]
[]
[null,null,"Oplysninger om medarbejderen"]
[]
[null,null,"Medarbejder 3"]
[null,"Medarbejderens lønkompensation fra sporskifte (kr./t.)",null,{"$f":"IF(D8>261,(IF(D11=\"Ja\",260-'Format ark'!D13,260)),IF(D8<=260,IF(D11=\"Ja\",IF(D8<'Format ark'!D13,0,D8-'Format ark'!D13),D8)))","v":0}]
[null,"Medarbejderens timesats (kr./t.)"]
[null,"Medarbejderens højst gennemførte uddannelse",null,null,{"$f":"IF(D9=\"\",\"Husk at vælge medarbejderens højst gennemførte uddannelse.\",\" \")","v":"Husk at vælge medarbejderens højst gennemførte uddannelse."}]
[null,"Har medarbejderen brugt sin uddannelse de senest 5 år?",null,null,{"$f":"IF(D10=\"\",\"Husk at svare på spørgsmålet.\",\" \")","v":"Husk at svare på spørgsmålet."}]
[null,"Medarbejder formodes at være berettiget til at få VEU-godtgørelse ",null,{"$f":"IF(OR(D9=\"Videregående uddannelse\",D9=\"Gymnasial uddannelse\")*AND(D10=\"ja\"),\"Nej\",\"Ja\")","v":"Ja"}]
[null,"Beskriv herunder hvad formålet med den planlagte sporskiftepakke er for medarbejderen:"]
[]
[]
[null,null,"Aktiviteter"]
[]
[null,"Afklaring, vejledning mv. \nSkriv navn på kursus",null,"Medarbejderens timeforbug (timer)","Evt. deltagerbetaling (kr.)","Giver kurset ret til VEU-godtgørelse?"]
[]
[]
[]
[]
[]
[null,"Samlet antal timer (udregner selv)",null,{"$f":"SUM(D18:D22)","v":0}]
[null,"Samlet lønkompensation udover evt. VEU-godtgørelse (udregner selv)",null,{"$f":"IF(D11=\"Nej\",D23*D7,0)+IF(AND(D11=\"Ja\",F18=\"Ja\"),D18*D7,0)+IF(AND(D11=\"Ja\",F19=\"Ja\"),D19*D7,0)+IF(AND(D11=\"Ja\",F20=\"Ja\"),D20*D7,0)+IF(AND(D11=\"Ja\",F21=\"Ja\"),D21*D7,0)+IF(AND(D11=\"Ja\",F22=\"Ja\"),D22*D7,0)+IF(AND(D11=\"Ja\",F18=\"Nej\"),D18*IF(D8>261,(IF(F18=\"Ja\",260-'Format ark'!D13,260)),IF(D8<=260,IF(F18=\"Ja\",D8-'Format ark'!D13,D8))),0)+IF(AND(D11=\"Ja\",F19=\"Nej\"),D19*IF(D8>261,(IF(F19=\"Ja\",260-'Format ark'!D13,260)),IF(D8<=260,IF(F19=\"Ja\",D8-'Format ark'!D13,D8))),0)+IF(AND(D11=\"Ja\",F20=\"Nej\"),D20*IF(D8>261,(IF(F20=\"Ja\",260-'Format ark'!D13,260)),IF(D8<=260,IF(F20=\"Ja\",D8-'Format ark'!D13,D8))),0)+IF(AND(D11=\"Ja\",F21=\"Nej\"),D21*IF(D8>261,(IF(F21=\"Ja\",260-'Format ark'!D13,260)),IF(D8<=260,IF(F21=\"Ja\",D8-'Format ark'!D13,D8))),0)+IF(AND(D11=\"Ja\",F22=\"Nej\"),D22*IF(D8>261,(IF(F22=\"Ja\",260-'Format ark'!D13,260)),IF(D8<=260,IF(F22=\"Ja\",D8-'Format ark'!D13,D8))),0)","v":0}]
[null,"Estimeret VEU-godtgørelse",null,{"$f":"IF(AND(D11=\"Ja\",F18=\"Ja\"),D18*'Format ark'!D13,0)+IF(AND(D11=\"Ja\",F19=\"Ja\"),D19*'Format ark'!D13,0)+IF(AND(D11=\"Ja\",F20=\"Ja\"),D20*'Format ark'!D13,0)+IF(AND(D11=\"Ja\",F21=\"Ja\"),D21*'Format ark'!D13,0)+IF(AND(D11=\"Ja\",F22=\"Ja\"),D22*'Format ark'!D13,0)","v":0}]
[null,"Samlet deltagerbeltaing (udregner selv)",null,{"$f":"SUM(E18:E22)","v":0}]
[]
[null,"Erhversrettet efteruddannelse\nSkriv navn på efteruddannelse",null,"Medarbejderens timeforbrug (timer)","Evt. deltagerbetaling (kr.)","Giver kurset ret til VEU-godtgørelse?"]
[]
[]
[]
[]
[]
[]
[]
[]
[]
[]
[]
[null,"Kørsel/transport (angives som faktisk udgift)",null,null,null,"Nej"]
[null,"Samlet antal timer (udregner selv)",null,{"$f":"SUM(D29:D40)","v":0}]
[null,"Samlet lønkompensation udover evt. VEU-godtgørelse (udregner selv)",null,{"$f":"IF(D11=\"Nej\",D41*D7,0)+IF(AND(D11=\"Ja\",F29=\"Ja\"),D29*D7,0)+IF(AND(D11=\"Ja\",F30=\"Ja\"),D30*D7,0)+IF(AND(D11=\"Ja\",F31=\"Ja\"),D31*D7,0)+IF(AND(D11=\"Ja\",F32=\"Ja\"),D32*D7,0)+IF(AND(D11=\"Ja\",F33=\"Ja\"),D33*D7,0)+IF(AND(D11=\"Ja\",F34=\"Ja\"),D34*D7,0)+IF(AND(D11=\"Ja\",F35=\"Ja\"),D35*D7,0)+IF(AND(D11=\"Ja\",F36=\"Ja\"),D36*D7,0)+IF(AND(D11=\"Ja\",F37=\"Ja\"),D37*D7,0)+IF(AND(D11=\"Ja\",F38=\"Ja\"),D38*D7,0)+IF(AND(D11=\"Ja\",F39=\"Ja\"),D39*D7,0)+IF(AND(D11=\"Ja\",F40=\"Ja\"),D40*D7,0)+IF(AND(D11=\"Ja\",F29=\"Nej\"),D29* IF(D8>261,(IF(F29=\"Ja\",260-'Format ark'!D13,260)),IF(D8<=260,IF(F29=\"Ja\",D8-'Format ark'!D13,D8))),0)+IF(AND(D11=\"Ja\",F30=\"Nej\"),D30* IF(D8>261,(IF(F30=\"Ja\",260-'Format ark'!D13,260)),IF(D8<=260,IF(F30=\"Ja\",D8-'Format ark'!D13,D8))),0)+IF(AND(D11=\"Ja\",F31=\"Nej\"),D31* IF(D8>261,(IF(F31=\"Ja\",260-'Format ark'!D13,260)),IF(D8<=260,IF(F31=\"Ja\",D8-'Format ark'!D13,D8))),0)+IF(AND(D11=\"Ja\",F32=\"Nej\"),D32* IF(D8>261,(IF(F32=\"Ja\",260-'Format ark'!D13,260)),IF(D8<=260,IF(F32=\"Ja\",D8-'Format ark'!D13,D8))),0)+IF(AND(D11=\"Ja\",F33=\"Nej\"),D33* IF(D8>261,(IF(F33=\"Ja\",260-'Format ark'!D13,260)),IF(D8<=260,IF(F33=\"Ja\",D8-'Format ark'!D13,D8))),0)+IF(AND(D11=\"Ja\",F34=\"Nej\"),D34* IF(D8>261,(IF(F34=\"Ja\",260-'Format ark'!D13,260)),IF(D8<=260,IF(F34=\"Ja\",D8-'Format ark'!D13,D8))),0)+IF(AND(D11=\"Ja\",F35=\"Nej\"),D35* IF(D8>261,(IF(F35=\"Ja\",260-'Format ark'!D13,260)),IF(D8<=260,IF(F35=\"Ja\",D8-'Format ark'!D13,D8))),0)+IF(AND(D11=\"Ja\",F36=\"Nej\"),D36* IF(D8>261,(IF(F36=\"Ja\",260-'Format ark'!D13,260)),IF(D8<=260,IF(F36=\"Ja\",D8-'Format ark'!D13,D8))),0)+IF(AND(D11=\"Ja\",F37=\"Nej\"),D37* IF(D8>261,(IF(F37=\"Ja\",260-'Format ark'!D13,260)),IF(D8<=260,IF(F37=\"Ja\",D8-'Format ark'!D13,D8))),0)+IF(AND(D11=\"Ja\",F38=\"Nej\"),D38* IF(D8>261,(IF(F38=\"Ja\",260-'Format ark'!D13,260)),IF(D8<=260,IF(F38=\"Ja\",D8-'Format ark'!D13,D8))),0)+IF(AND(D11=\"Ja\",F39=\"Nej\"),D39* IF(D8>261,(IF(F39=\"Ja\",260-'Format ark'!D13,260)),IF(D8<=260,IF(F39=\"Ja\",D8-'Format ark'!D13,D8))),0)+IF(AND(D11=\"Ja\",F40=\"Nej\"),D40* IF(D8>261,(IF(F40=\"Ja\",260-'Format ark'!D13,260)),IF(D8<=260,IF(F40=\"Ja\",D8-'Format ark'!D13,D8))),0)","v":0}]
[null,"Estimeret VEU-godtgørelse",null,{"$f":"IF(AND(D11=\"Ja\",F29=\"Ja\"),D29*'Format ark'!D13,0)+IF(AND(D11=\"Ja\",F30=\"Ja\"),D30*'Format ark'!D13,0)+IF(AND(D11=\"Ja\",F31=\"Ja\"),D31*'Format ark'!D13,0)+IF(AND(D11=\"Ja\",F32=\"Ja\"),D32*('Format ark'!D13),0)+IF(AND(D11=\"Ja\",F33=\"Ja\"),D33*'Format ark'!D13,0)+IF(AND(D11=\"Ja\",F34=\"Ja\"),D34*'Format ark'!D13,0)+IF(AND(D11=\"Ja\",F35=\"Ja\"),D35*'Format ark'!D13,0)+IF(AND(D11=\"Ja\",F36=\"Ja\"),D36*'Format ark'!D13,0)+IF(AND(D11=\"Ja\",F37=\"Ja\"),D37*'Format ark'!D13,0)+IF(AND(D11=\"Ja\",F38=\"Ja\"),D38*'Format ark'!D13,0)+IF(AND(D11=\"Ja\",F39=\"Ja\"),D39*'Format ark'!D13,0)+IF(AND(D11=\"Ja\",F40=\"Ja\"),D40*'Format ark'!D13,0)","v":0}]
[null,"Samlet deltagerbetaling (udregner selv)",null,{"$f":"SUM(E29:E40)","v":0}]
[]
[null,"Praktik"]
[null,"Navn på virksomhed og p-nummer"]
[null,"Medarbejderens timeforbrug",null,null,{"$f":"IF(D48>C51*0.5,\"Praktik må maksimalt udgøre 50% af det samlede tidsforbrug.\",\" \")","v":" "}]
[null,"Samlet lønkompensation for praktikopholdet",null,{"$f":"IF(D48>C51*0.5,\"IKKE MULIGT\",D48*(IF(D8>261,260,D8)))","v":0}]
[]
[null,"Samlet tidsforbrug ",{"$f":"IF(D48+D41+D23>300,\"IKKE MULIGT\",D48+D41+D23)","v":0},{"$f":"IF(C51>300,\"Det maksimale tidsforbrug er 300 timer\",\" \")","v":" "}]
[]
[null,"Tidsforbrug til administration","Antal timer","Beløb"]
[null,"Der kan godtgøres op til 5 timer.",null,{"$f":"IF(C54>5,\"Der kan maksimalt godtgøres 5 timer pr. medarbejder.\",C54*260)","v":0}]
[]
[null,"Samlet tilsagnsramme i kr. (maksimal støtte til sporskiftepakken): ",null,{"$f":"IF(C51>300,0,MIN(D49+D44+D42+D26+D24+D54,120000))","v":0},{"$f":"IF(D56=120000,\"Det maksimale tilsagn pr. sporskiftepakke er nået, og det overstigende beløb er derfor selvbetaling.\",\"\")","v":""}]
[]
[]
[null,"Estimeret VEU-godtgørelse",null,{"$f":"D43+D25","v":0}]
[]
[null,"Selvbetaling i kr. (udgifter udover den øvre tilsagnsramme)",null,{"$f":"IF(C51>300,0,IF(D56=120000,D44+D26+D42+D49+D24+D54-120000,0))","v":0}]

{"sheet":"Medarbejder 4","index":4,"n_rows":61,"n_cols":6,"rows_kept":61,"cut":false,"hidden":true,"merged":[[6,1,6,2],[8,1,8,2],[7,1,7,2],[55,1,56,2],[8,4,8,5],[21,1,21,2],[9,1,9,2],[9,4,9,5],[10,1,10,2],[11,1,11,3],[12,1,12,3],[17,1,17,2],[18,1,18,2],[19,1,19,2],[20,1,20,2],[55,3,56,3],[16,1,16,2],[33,1,33,2],[34,1,34,2],[27,1,27,2],[28,1,28,2],[29,1,29,2],[30,1,30,2],[31,1,31,2],[32,1,32,2],[35,1,35,2],[37,1,37,2],[38,1,38,2],[39,1,39,2],[36,1,36,2]]}
[]
[null,null,"Budget/Regnskab for sporskiftepakken"]
[]
[null,null,"Oplysninger om medarbejderen"]
[]
[null,null,"Medarbejder 4"]
[null,"Medarbejderens lønkompensation fra sporskifte (kr./t.)",null,{"$f":"IF(D8>261,(IF(D11=\"Ja\",260-'Format ark'!D13,260)),IF(D8<=260,IF(D11=\"Ja\",IF(D8<'Format ark'!D13,0,D8-'Format ark'!D13),D8)))","v":0}]
[null,"Medarbejderens timesats (kr./t.)"]
[null,"Medarbejderens højst gennemførte uddannelse",null,null,{"$f":"IF(D9=\"\",\"Husk at vælge medarbejderens højst gennemførte uddannelse.\",\" \")","v":"Husk at vælge medarbejderens højst gennemførte uddannelse."}]
[null,"Har medarbejderen brugt sin uddannelse de senest 5 år?",null,null,{"$f":"IF(D10=\"\",\"Husk at svare på spørgsmålet.\",\" \")","v":"Husk at svare på spørgsmålet."}]
[null,"Medarbejder formodes at være berettiget til at få VEU-godtgørelse ",null,{"$f":"IF(OR(D9=\"Videregående uddannelse\",D9=\"Gymnasial uddannelse\")*AND(D10=\"ja\"),\"Nej\",\"Ja\")","v":"Ja"}]
[null,"Beskriv herunder hvad formålet med den planlagte sporskiftepakke er for medarbejderen:"]
[]
[]
[null,null,"Aktiviteter"]
[]
[null,"Afklaring, vejledning mv. \nSkriv navn på kursus",null,"Medarbejderens timeforbug (timer)","Evt. deltagerbetaling (kr.)","Giver kurset ret til VEU-godtgørelse?"]
[]
[]
[]
[]
[]
[null,"Samlet antal timer (udregner selv)",null,{"$f":"SUM(D18:D22)","v":0}]
[null,"Samlet lønkompensation udover evt. VEU-godtgørelse (udregner selv)",null,{"$f":"IF(D11=\"Nej\",D23*D7,0)+IF(AND(D11=\"Ja\",F18=\"Ja\"),D18*D7,0)+IF(AND(D11=\"Ja\",F19=\"Ja\"),D19*D7,0)+IF(AND(D11=\"Ja\",F20=\"Ja\"),D20*D7,0)+IF(AND(D11=\"Ja\",F21=\"Ja\"),D21*D7,0)+IF(AND(D11=\"Ja\",F22=\"Ja\"),D22*D7,0)+IF(AND(D11=\"Ja\",F18=\"Nej\"),D18*IF(D8>261,(IF(F18=\"Ja\",260-'Format ark'!D13,260)),IF(D8<=260,IF(F18=\"Ja\",D8-'Format ark'!D13,D8))),0)+IF(AND(D11=\"Ja\",F19=\"Nej\"),D19*IF(D8>261,(IF(F19=\"Ja\",260-'Format ark'!D13,260)),IF(D8<=260,IF(F19=\"Ja\",D8-'Format ark'!D13,D8))),0)+IF(AND(D11=\"Ja\",F20=\"Nej\"),D20*IF(D8>261,(IF(F20=\"Ja\",260-'Format ark'!D13,260)),IF(D8<=260,IF(F20=\"Ja\",D8-'Format ark'!D13,D8))),0)+IF(AND(D11=\"Ja\",F21=\"Nej\"),D21*IF(D8>261,(IF(F21=\"Ja\",260-'Format ark'!D13,260)),IF(D8<=260,IF(F21=\"Ja\",D8-'Format ark'!D13,D8))),0)+IF(AND(D11=\"Ja\",F22=\"Nej\"),D22*IF(D8>261,(IF(F22=\"Ja\",260-'Format ark'!D13,260)),IF(D8<=260,IF(F22=\"Ja\",D8-'Format ark'!D13,D8))),0)","v":0}]
[null,"Estimeret VEU-godtgørelse",null,{"$f":"IF(AND(D11=\"Ja\",F18=\"Ja\"),D18*'Format ark'!D13,0)+IF(AND(D11=\"Ja\",F19=\"Ja\"),D19*'Format ark'!D13,0)+IF(AND(D11=\"Ja\",F20=\"Ja\"),D20*'Format ark'!D13,0)+IF(AND(D11=\"Ja\",F21=\"Ja\"),D21*'Format ark'!D13,0)+IF(AND(D11=\"Ja\",F22=\"Ja\"),D22*'Format ark'!D13,0)","v":0}]
[null,"Samlet deltagerbeltaing (udregner selv)",null,{"$f":"SUM(E18:E22)","v":0}]
[]
[null,"Erhversrettet efteruddannelse\nSkriv navn på efteruddannelse",null,"Medarbejderens timeforbrug (timer)","Evt. deltagerbetaling (kr.)","Giver kurset ret til VEU-godtgørelse?"]
[]
[]
[]
[]
[]
[]
[]
[]
[]
[]
[]
[null,"Kørsel/transport (angives som faktisk udgift)",null,null,null,"Nej"]
[null,"Samlet antal timer (udregner selv)",null,{"$f":"SUM(D29:D40)","v":0}]
[null,"Samlet lønkompensation udover evt. VEU-godtgørelse (udregner selv)",null,{"$f":"IF(D11=\"Nej\",D41*D7,0)+IF(AND(D11=\"Ja\",F29=\"Ja\"),D29*D7,0)+IF(AND(D11=\"Ja\",F30=\"Ja\"),D30*D7,0)+IF(AND(D11=\"Ja\",F31=\"Ja\"),D31*D7,0)+IF(AND(D11=\"Ja\",F32=\"Ja\"),D32*D7,0)+IF(AND(D11=\"Ja\",F33=\"Ja\"),D33*D7,0)+IF(AND(D11=\"Ja\",F34=\"Ja\"),D34*D7,0)+IF(AND(D11=\"Ja\",F35=\"Ja\"),D35*D7,0)+IF(AND(D11=\"Ja\",F36=\"Ja\"),D36*D7,0)+IF(AND(D11=\"Ja\",F37=\"Ja\"),D37*D7,0)+IF(AND(D11=\"Ja\",F38=\"Ja\"),D38*D7,0)+IF(AND(D11=\"Ja\",F39=\"Ja\"),D39*D7,0)+IF(AND(D11=\"Ja\",F40=\"Ja\"),D40*D7,0)+IF(AND(D11=\"Ja\",F29=\"Nej\"),D29* IF(D8>261,(IF(F29=\"Ja\",260-'Format ark'!D13,260)),IF(D8<=260,IF(F29=\"Ja\",D8-'Format ark'!D13,D8))),0)+IF(AND(D11=\"Ja\",F30=\"Nej\"),D30* IF(D8>261,(IF(F30=\"Ja\",260-'Format ark'!D13,260)),IF(D8<=260,IF(F30=\"Ja\",D8-'Format ark'!D13,D8))),0)+IF(AND(D11=\"Ja\",F31=\"Nej\"),D31* IF(D8>261,(IF(F31=\"Ja\",260-'Format ark'!D13,260)),IF(D8<=260,IF(F31=\"Ja\",D8-'Format ark'!D13,D8))),0)+IF(AND(D11=\"Ja\",F32=\"Nej\"),D32* IF(D8>261,(IF(F32=\"Ja\",260-'Format ark'!D13,260)),IF(D8<=260,IF(F32=\"Ja\",D8-'Format ark'!D13,D8))),0)+IF(AND(D11=\"Ja\",F33=\"Nej\"),D33* IF(D8>261,(IF(F33=\"Ja\",260-'Format ark'!D13,260)),IF(D8<=260,IF(F33=\"Ja\",D8-'Format ark'!D13,D8))),0)+IF(AND(D11=\"Ja\",F34=\"Nej\"),D34* IF(D8>261,(IF(F34=\"Ja\",260-'Format ark'!D13,260)),IF(D8<=260,IF(F34=\"Ja\",D8-'Format ark'!D13,D8))),0)+IF(AND(D11=\"Ja\",F35=\"Nej\"),D35* IF(D8>261,(IF(F35=\"Ja\",260-'Format ark'!D13,260)),IF(D8<=260,IF(F35=\"Ja\",D8-'Format ark'!D13,D8))),0)+IF(AND(D11=\"Ja\",F36=\"Nej\"),D36* IF(D8>261,(IF(F36=\"Ja\",260-'Format ark'!D13,260)),IF(D8<=260,IF(F36=\"Ja\",D8-'Format ark'!D13,D8))),0)+IF(AND(D11=\"Ja\",F37=\"Nej\"),D37* IF(D8>261,(IF(F37=\"Ja\",260-'Format ark'!D13,260)),IF(D8<=260,IF(F37=\"Ja\",D8-'Format ark'!D13,D8))),0)+IF(AND(D11=\"Ja\",F38=\"Nej\"),D38* IF(D8>261,(IF(F38=\"Ja\",260-'Format ark'!D13,260)),IF(D8<=260,IF(F38=\"Ja\",D8-'Format ark'!D13,D8))),0)+IF(AND(D11=\"Ja\",F39=\"Nej\"),D39* IF(D8>261,(IF(F39=\"Ja\",260-'Format ark'!D13,260)),IF(D8<=260,IF(F39=\"Ja\",D8-'Format ark'!D13,D8))),0)+IF(AND(D11=\"Ja\",F40=\"Nej\"),D40* IF(D8>261,(IF(F40=\"Ja\",260-'Format ark'!D13,260)),IF(D8<=260,IF(F40=\"Ja\",D8-'Format ark'!D13,D8))),0)","v":0}]
[null,"Estimeret VEU-godtgørelse",null,{"$f":"IF(AND(D11=\"Ja\",F29=\"Ja\"),D29*'Format ark'!D13,0)+IF(AND(D11=\"Ja\",F30=\"Ja\"),D30*'Format ark'!D13,0)+IF(AND(D11=\"Ja\",F31=\"Ja\"),D31*'Format ark'!D13,0)+IF(AND(D11=\"Ja\",F32=\"Ja\"),D32*('Format ark'!D13),0)+IF(AND(D11=\"Ja\",F33=\"Ja\"),D33*'Format ark'!D13,0)+IF(AND(D11=\"Ja\",F34=\"Ja\"),D34*'Format ark'!D13,0)+IF(AND(D11=\"Ja\",F35=\"Ja\"),D35*'Format ark'!D13,0)+IF(AND(D11=\"Ja\",F36=\"Ja\"),D36*'Format ark'!D13,0)+IF(AND(D11=\"Ja\",F37=\"Ja\"),D37*'Format ark'!D13,0)+IF(AND(D11=\"Ja\",F38=\"Ja\"),D38*'Format ark'!D13,0)+IF(AND(D11=\"Ja\",F39=\"Ja\"),D39*'Format ark'!D13,0)+IF(AND(D11=\"Ja\",F40=\"Ja\"),D40*'Format ark'!D13,0)","v":0}]
[null,"Samlet deltagerbetaling (udregner selv)",null,{"$f":"SUM(E29:E40)","v":0}]
[]
[null,"Praktik"]
[null,"Navn på virksomhed og p-nummer"]
[null,"Medarbejderens timeforbrug",null,null,{"$f":"IF(D48>C51*0.5,\"Praktik må maksimalt udgøre 50% af det samlede tidsforbrug.\",\" \")","v":" "}]
[null,"Samlet lønkompensation for praktikopholdet",null,{"$f":"IF(D48>C51*0.5,\"IKKE MULIGT\",D48*(IF(D8>261,260,D8)))","v":0}]
[]
[null,"Samlet tidsforbrug ",{"$f":"IF(D48+D41+D23>300,\"IKKE MULIGT\",D48+D41+D23)","v":0},{"$f":"IF(C51>300,\"Det maksimale tidsforbrug er 300 timer\",\" \")","v":" "}]
[]
[null,"Tidsforbrug til administration","Antal timer","Beløb"]
[null,"Der kan godtgøres op til 5 timer.",null,{"$f":"IF(C54>5,\"Der kan maksimalt godtgøres 5 timer pr. medarbejder.\",C54*260)","v":0}]
[]
[null,"Samlet tilsagnsramme i kr. (maksimal støtte til sporskiftepakken): ",null,{"$f":"IF(C51>300,0,MIN(D49+D44+D42+D26+D24+D54,120000))","v":0},{"$f":"IF(D56=120000,\"Det maksimale tilsagn pr. sporskiftepakke er nået, og det overstigende beløb er derfor selvbetaling.\",\"\")","v":""}]
[]
[]
[null,"Estimeret VEU-godtgørelse",null,{"$f":"D43+D25","v":0}]
[]
[null,"Selvbetaling i kr. (udgifter udover den øvre tilsagnsramme)",null,{"$f":"IF(C51>300,0,IF(D56=120000,D44+D26+D42+D49+D24+D54-120000,0))","v":0}]

{"sheet":"Medarbejder 5","index":5,"n_rows":61,"n_cols":6,"rows_kept":61,"cut":false,"hidden":true,"merged":[[6,1,6,2],[8,1,8,2],[7,1,7,2],[55,1,56,2],[8,4,8,5],[21,1,21,2],[9,1,9,2],[9,4,9,5],[10,1,10,2],[11,1,11,3],[12,1,12,3],[17,1,17,2],[18,1,18,2],[19,1,19,2],[20,1,20,2],[55,3,56,3],[16,1,16,2],[33,1,33,2],[34,1,34,2],[27,1,27,2],[28,1,28,2],[29,1,29,2],[30,1,30,2],[31,1,31,2],[32,1,32,2],[35,1,35,2],[36,1,36,2],[37,1,37,2],[38,1,38,2],[39,1,39,2]]}
[{"$f":"Vejledning!P21","v":0}]
[null,null,"Budget/Regnskab for sporskiftepakken"]
[]
[null,null,"Oplysninger om medarbejderen"]
[]
[null,null,"Medarbejder 5"]
[null,"Medarbejderens lønkompensation fra sporskifte (kr./t.)",null,{"$f":"IF(D8>261,(IF(D11=\"Ja\",260-'Format ark'!D13,260)),IF(D8<=260,IF(D11=\"Ja\",IF(D8<'Format ark'!D13,0,D8-'Format ark'!D13),D8)))","v":0}]
[null,"Medarbejderens timesats (kr./t.)"]
[null,"Medarbejderens højst gennemførte uddannelse",null,null,{"$f":"IF(D9=\"\",\"Husk at vælge medarbejderens højst gennemførte uddannelse.\",\" \")","v":"Husk at vælge medarbejderens højst gennemførte uddannelse."}]
[null,"Har medarbejderen brugt sin uddannelse de senest 5 år?",null,null,{"$f":"IF(D10=\"\",\"Husk at svare på spørgsmålet.\",\" \")","v":"Husk at svare på spørgsmålet."}]
[null,"Medarbejder formodes at være berettiget til at få VEU-godtgørelse ",null,{"$f":"IF(OR(D9=\"Videregående uddannelse\",D9=\"Gymnasial uddannelse\")*AND(D10=\"ja\"),\"Nej\",\"Ja\")","v":"Ja"}]
[null,"Beskriv herunder hvad formålet med den planlagte sporskiftepakke er for medarbejderen:"]
[]
[]
[null,null,"Aktiviteter"]
[]
[null,"Afklaring, vejledning mv. \nSkriv navn på kursus",null,"Medarbejderens timeforbug (timer)","Evt. deltagerbetaling (kr.)","Giver kurset ret til VEU-godtgørelse?"]
[]
[]
[]
[]
[]
[null,"Samlet antal timer (udregner selv)",null,{"$f":"SUM(D18:D22)","v":0}]
[null,"Samlet lønkompensation udover evt. VEU-godtgørelse (udregner selv)",null,{"$f":"IF(D11=\"Nej\",D23*D7,0)+IF(AND(D11=\"Ja\",F18=\"Ja\"),D18*D7,0)+IF(AND(D11=\"Ja\",F19=\"Ja\"),D19*D7,0)+IF(AND(D11=\"Ja\",F20=\"Ja\"),D20*D7,0)+IF(AND(D11=\"Ja\",F21=\"Ja\"),D21*D7,0)+IF(AND(D11=\"Ja\",F22=\"Ja\"),D22*D7,0)+IF(AND(D11=\"Ja\",F18=\"Nej\"),D18*IF(D8>261,(IF(F18=\"Ja\",260-'Format ark'!D13,260)),IF(D8<=260,IF(F18=\"Ja\",D8-'Format ark'!D13,D8))),0)+IF(AND(D11=\"Ja\",F19=\"Nej\"),D19*IF(D8>261,(IF(F19=\"Ja\",260-'Format ark'!D13,260)),IF(D8<=260,IF(F19=\"Ja\",D8-'Format ark'!D13,D8))),0)+IF(AND(D11=\"Ja\",F20=\"Nej\"),D20*IF(D8>261,(IF(F20=\"Ja\",260-'Format ark'!D13,260)),IF(D8<=260,IF(F20=\"Ja\",D8-'Format ark'!D13,D8))),0)+IF(AND(D11=\"Ja\",F21=\"Nej\"),D21*IF(D8>261,(IF(F21=\"Ja\",260-'Format ark'!D13,260)),IF(D8<=260,IF(F21=\"Ja\",D8-'Format ark'!D13,D8))),0)+IF(AND(D11=\"Ja\",F22=\"Nej\"),D22*IF(D8>261,(IF(F22=\"Ja\",260-'Format ark'!D13,260)),IF(D8<=260,IF(F22=\"Ja\",D8-'Format ark'!D13,D8))),0)","v":0}]
[null,"Estimeret VEU-godtgørelse",null,{"$f":"IF(AND(D11=\"Ja\",F18=\"Ja\"),D18*'Format ark'!D13,0)+IF(AND(D11=\"Ja\",F19=\"Ja\"),D19*'Format ark'!D13,0)+IF(AND(D11=\"Ja\",F20=\"Ja\"),D20*'Format ark'!D13,0)+IF(AND(D11=\"Ja\",F21=\"Ja\"),D21*'Format ark'!D13,0)+IF(AND(D11=\"Ja\",F22=\"Ja\"),D22*'Format ark'!D13,0)","v":0}]
[null,"Samlet deltagerbeltaing (udregner selv)",null,{"$f":"SUM(E18:E22)","v":0}]
[]
[null,"Erhversrettet efteruddannelse\nSkriv navn på efteruddannelse",null,"Medarbejderens timeforbrug (timer)","Evt. deltagerbetaling (kr.)","Giver kurset ret til VEU-godtgørelse?"]
[]
[]
[]
[]
[]
[]
[]
[]
[]
[]
[]
[null,"Kørsel/transport (angives som faktisk udgift)",null,null,null,"Nej"]
[null,"Samlet antal timer (udregner selv)",null,{"$f":"SUM(D29:D40)","v":0}]
[null,"Samlet lønkompensation udover evt. VEU-godtgørelse (udregner selv)",null,{"$f":"IF(D11=\"Nej\",D41*D7,0)+IF(AND(D11=\"Ja\",F29=\"Ja\"),D29*D7,0)+IF(AND(D11=\"Ja\",F30=\"Ja\"),D30*D7,0)+IF(AND(D11=\"Ja\",F31=\"Ja\"),D31*D7,0)+IF(AND(D11=\"Ja\",F32=\"Ja\"),D32*D7,0)+IF(AND(D11=\"Ja\",F33=\"Ja\"),D33*D7,0)+IF(AND(D11=\"Ja\",F34=\"Ja\"),D34*D7,0)+IF(AND(D11=\"Ja\",F35=\"Ja\"),D35*D7,0)+IF(AND(D11=\"Ja\",F36=\"Ja\"),D36*D7,0)+IF(AND(D11=\"Ja\",F37=\"Ja\"),D37*D7,0)+IF(AND(D11=\"Ja\",F38=\"Ja\"),D38*D7,0)+IF(AND(D11=\"Ja\",F39=\"Ja\"),D39*D7,0)+IF(AND(D11=\"Ja\",F40=\"Ja\"),D40*D7,0)+IF(AND(D11=\"Ja\",F29=\"Nej\"),D29* IF(D8>261,(IF(F29=\"Ja\",260-'Format ark'!D13,260)),IF(D8<=260,IF(F29=\"Ja\",D8-'Format ark'!D13,D8))),0)+IF(AND(D11=\"Ja\",F30=\"Nej\"),D30* IF(D8>261,(IF(F30=\"Ja\",260-'Format ark'!D13,260)),IF(D8<=260,IF(F30=\"Ja\",D8-'Format ark'!D13,D8))),0)+IF(AND(D11=\"Ja\",F31=\"Nej\"),D31* IF(D8>261,(IF(F31=\"Ja\",260-'Format ark'!D13,260)),IF(D8<=260,IF(F31=\"Ja\",D8-'Format ark'!D13,D8))),0)+IF(AND(D11=\"Ja\",F32=\"Nej\"),D32* IF(D8>261,(IF(F32=\"Ja\",260-'Format ark'!D13,260)),IF(D8<=260,IF(F32=\"Ja\",D8-'Format ark'!D13,D8))),0)+IF(AND(D11=\"Ja\",F33=\"Nej\"),D33* IF(D8>261,(IF(F33=\"Ja\",260-'Format ark'!D13,260)),IF(D8<=260,IF(F33=\"Ja\",D8-'Format ark'!D13,D8))),0)+IF(AND(D11=\"Ja\",F34=\"Nej\"),D34* IF(D8>261,(IF(F34=\"Ja\",260-'Format ark'!D13,260)),IF(D8<=260,IF(F34=\"Ja\",D8-'Format ark'!D13,D8))),0)+IF(AND(D11=\"Ja\",F35=\"Nej\"),D35* IF(D8>261,(IF(F35=\"Ja\",260-'Format ark'!D13,260)),IF(D8<=260,IF(F35=\"Ja\",D8-'Format ark'!D13,D8))),0)+IF(AND(D11=\"Ja\",F36=\"Nej\"),D36* IF(D8>261,(IF(F36=\"Ja\",260-'Format ark'!D13,260)),IF(D8<=260,IF(F36=\"Ja\",D8-'Format ark'!D13,D8))),0)+IF(AND(D11=\"Ja\",F37=\"Nej\"),D37* IF(D8>261,(IF(F37=\"Ja\",260-'Format ark'!D13,260)),IF(D8<=260,IF(F37=\"Ja\",D8-'Format ark'!D13,D8))),0)+IF(AND(D11=\"Ja\",F38=\"Nej\"),D38* IF(D8>261,(IF(F38=\"Ja\",260-'Format ark'!D13,260)),IF(D8<=260,IF(F38=\"Ja\",D8-'Format ark'!D13,D8))),0)+IF(AND(D11=\"Ja\",F39=\"Nej\"),D39* IF(D8>261,(IF(F39=\"Ja\",260-'Format ark'!D13,260)),IF(D8<=260,IF(F39=\"Ja\",D8-'Format ark'!D13,D8))),0)+IF(AND(D11=\"Ja\",F40=\"Nej\"),D40* IF(D8>261,(IF(F40=\"Ja\",260-'Format ark'!D13,260)),IF(D8<=260,IF(F40=\"Ja\",D8-'Format ark'!D13,D8))),0)","v":0}]
[null,"Estimeret VEU-godtgørelse",null,{"$f":"IF(AND(D11=\"Ja\",F29=\"Ja\"),D29*'Format ark'!D13,0)+IF(AND(D11=\"Ja\",F30=\"Ja\"),D30*'Format ark'!D13,0)+IF(AND(D11=\"Ja\",F31=\"Ja\"),D31*'Format ark'!D13,0)+IF(AND(D11=\"Ja\",F32=\"Ja\"),D32*('Format ark'!D13),0)+IF(AND(D11=\"Ja\",F33=\"Ja\"),D33*'Format ark'!D13,0)+IF(AND(D11=\"Ja\",F34=\"Ja\"),D34*'Format ark'!D13,0)+IF(AND(D11=\"Ja\",F35=\"Ja\"),D35*'Format ark'!D13,0)+IF(AND(D11=\"Ja\",F36=\"Ja\"),D36*'Format ark'!D13,0)+IF(AND(D11=\"Ja\",F37=\"Ja\"),D37*'Format ark'!D13,0)+IF(AND(D11=\"Ja\",F38=\"Ja\"),D38*'Format ark'!D13,0)+IF(AND(D11=\"Ja\",F39=\"Ja\"),D39*'Format ark'!D13,0)+IF(AND(D11=\"Ja\",F40=\"Ja\"),D40*'Format ark'!D13,0)","v":0}]
[null,"Samlet deltagerbetaling (udregner selv)",null,{"$f":"SUM(E29:E40)","v":0}]
[]
[null,"Praktik"]
[null,"Navn på virksomhed og p-nummer"]
[null,"Medarbejderens timeforbrug",null,null,{"$f":"IF(D48>C51*0.5,\"Praktik må maksimalt udgøre 50% af det samlede tidsforbrug.\",\" \")","v":" "}]
[null,"Samlet lønkompensation for praktikopholdet",null,{"$f":"IF(D48>C51*0.5,\"IKKE MULIGT\",D48*(IF(D8>261,260,D8)))","v":0}]
[]
[null,"Samlet tidsforbrug ",{"$f":"IF(D48+D41+D23>300,\"IKKE MULIGT\",D48+D41+D23)","v":0},{"$f":"IF(C51>300,\"Det maksimale tidsforbrug er 300 timer\",\" \")","v":" "}]
[]
[null,"Tidsforbrug til administration","Antal timer","Beløb"]
[null,"Der kan godtgøres op til 5 timer.",null,{"$f":"IF(C54>5,\"Der kan maksimalt godtgøres 5 timer pr. medarbejder.\",C54*260)","v":0}]
[]
[null,"Samlet tilsagnsramme i kr. (maksimal støtte til sporskiftepakken): ",null,{"$f":"IF(C51>300,0,MIN(D49+D44+D42+D26+D24+D54,120000))","v":0},{"$f":"IF(D56=120000,\"Det maksimale tilsagn pr. sporskiftepakke er nået, og det overstigende beløb er derfor selvbetaling.\",\"\")","v":""}]
[]
[]
[null,"Estimeret VEU-godtgørelse",null,{"$f":"D43+D25","v":0}]
[]
[null,"Selvbetaling i kr. (udgifter udover den øvre tilsagnsramme)",null,{"$f":"IF(C51>300,0,IF(D56=120000,D44+D26+D42+D49+D24+D54-120000,0))","v":0}]

{"sheet":"Medarbejder 6","index":6,"n_rows":61,"n_cols":6,"rows_kept":61,"cut":false,"hidden":true,"merged":[[6,1,6,2],[8,1,8,2],[7,1,7,2],[55,1,56,2],[8,4,8,5],[21,1,21,2],[9,1,9,2],[9,4,9,5],[10,1,10,2],[11,1,11,3],[12,1,12,3],[17,1,17,2],[18,1,18,2],[19,1,19,2],[20,1,20,2],[55,3,56,3],[16,1,16,2],[33,1,33,2],[34,1,34,2],[27,1,27,2],[28,1,28,2],[29,1,29,2],[30,1,30,2],[31,1,31,2],[32,1,32,2],[35,1,35,2],[36,1,36,2],[37,1,37,2],[38,1,38,2],[39,1,39,2]]}
[]
[null,null,"Budget/Regnskab for sporskiftepakken"]
[]
[null,null,"Oplysninger om medarbejderen"]
[]
[null,null,"Medarbejder 6"]
[null,"Medarbejderens lønkompensation fra sporskifte (kr./t.)",null,{"$f":"IF(D8>261,(IF(D11=\"Ja\",260-'Format ark'!D13,260)),IF(D8<=260,IF(D11=\"Ja\",IF(D8<'Format ark'!D13,0,D8-'Format ark'!D13),D8)))","v":0}]
[null,"Medarbejderens timesats (kr./t.)"]
[null,"Medarbejderens højst gennemførte uddannelse",null,null,{"$f":"IF(D9=\"\",\"Husk at vælge medarbejderens højst gennemførte uddannelse.\",\" \")","v":"Husk at vælge medarbejderens højst gennemførte uddannelse."}]
[null,"Har medarbejderen brugt sin uddannelse de senest 5 år?",null,null,{"$f":"IF(D10=\"\",\"Husk at svare på spørgsmålet.\",\" \")","v":"Husk at svare på spørgsmålet."}]
[null,"Medarbejder formodes at være berettiget til at få VEU-godtgørelse ",null,{"$f":"IF(OR(D9=\"Videregående uddannelse\",D9=\"Gymnasial uddannelse\")*AND(D10=\"ja\"),\"Nej\",\"Ja\")","v":"Ja"}]
[null,"Beskriv herunder hvad formålet med den planlagte sporskiftepakke er for medarbejderen:"]
[]
[]
[null,null,"Aktiviteter"]
[]
[null,"Afklaring, vejledning mv. \nSkriv navn på kursus",null,"Medarbejderens timeforbug (timer)","Evt. deltagerbetaling (kr.)","Giver kurset ret til VEU-godtgørelse?"]
[]
[]
[]
[]
[]
[null,"Samlet antal timer (udregner selv)",null,{"$f":"SUM(D18:D22)","v":0}]
[null,"Samlet lønkompensation udover evt. VEU-godtgørelse (udregner selv)",null,{"$f":"IF(D11=\"Nej\",D23*D7,0)+IF(AND(D11=\"Ja\",F18=\"Ja\"),D18*D7,0)+IF(AND(D11=\"Ja\",F19=\"Ja\"),D19*D7,0)+IF(AND(D11=\"Ja\",F20=\"Ja\"),D20*D7,0)+IF(AND(D11=\"Ja\",F21=\"Ja\"),D21*D7,0)+IF(AND(D11=\"Ja\",F22=\"Ja\"),D22*D7,0)+IF(AND(D11=\"Ja\",F18=\"Nej\"),D18*IF(D8>261,(IF(F18=\"Ja\",260-'Format ark'!D13,260)),IF(D8<=260,IF(F18=\"Ja\",D8-'Format ark'!D13,D8))),0)+IF(AND(D11=\"Ja\",F19=\"Nej\"),D19*IF(D8>261,(IF(F19=\"Ja\",260-'Format ark'!D13,260)),IF(D8<=260,IF(F19=\"Ja\",D8-'Format ark'!D13,D8))),0)+IF(AND(D11=\"Ja\",F20=\"Nej\"),D20*IF(D8>261,(IF(F20=\"Ja\",260-'Format ark'!D13,260)),IF(D8<=260,IF(F20=\"Ja\",D8-'Format ark'!D13,D8))),0)+IF(AND(D11=\"Ja\",F21=\"Nej\"),D21*IF(D8>261,(IF(F21=\"Ja\",260-'Format ark'!D13,260)),IF(D8<=260,IF(F21=\"Ja\",D8-'Format ark'!D13,D8))),0)+IF(AND(D11=\"Ja\",F22=\"Nej\"),D22*IF(D8>261,(IF(F22=\"Ja\",260-'Format ark'!D13,260)),IF(D8<=260,IF(F22=\"Ja\",D8-'Format ark'!D13,D8))),0)","v":0}]
[null,"Estimeret VEU-godtgørelse",null,{"$f":"IF(AND(D11=\"Ja\",F18=\"Ja\"),D18*'Format ark'!D13,0)+IF(AND(D11=\"Ja\",F19=\"Ja\"),D19*'Format ark'!D13,0)+IF(AND(D11=\"Ja\",F20=\"Ja\"),D20*'Format ark'!D13,0)+IF(AND(D11=\"Ja\",F21=\"Ja\"),D21*'Format ark'!D13,0)+IF(AND(D11=\"Ja\",F22=\"Ja\"),D22*'Format ark'!D13,0)","v":0}]
[null,"Samlet deltagerbeltaing (udregner selv)",null,{"$f":"SUM(E18:E22)","v":0}]
[]
[null,"Erhversrettet efteruddannelse\nSkriv navn på efteruddannelse",null,"Medarbejderens timeforbrug (timer)","Evt. deltagerbetaling (kr.)","Giver kurset ret til VEU-godtgørelse?"]
[]
[]
[]
[]
[]
[]
[]
[]
[]
[]
[]
[null,"Kørsel/transport (angives som faktisk udgift)",null,null,null,"Nej"]
[null,"Samlet antal timer (udregner selv)",null,{"$f":"SUM(D29:D40)","v":0}]
[null,"Samlet lønkompensation udover evt. VEU-godtgørelse (udregner selv)",null,{"$f":"IF(D11=\"Nej\",D41*D7,0)+IF(AND(D11=\"Ja\",F29=\"Ja\"),D29*D7,0)+IF(AND(D11=\"Ja\",F30=\"Ja\"),D30*D7,0)+IF(AND(D11=\"Ja\",F31=\"Ja\"),D31*D7,0)+IF(AND(D11=\"Ja\",F32=\"Ja\"),D32*D7,0)+IF(AND(D11=\"Ja\",F33=\"Ja\"),D33*D7,0)+IF(AND(D11=\"Ja\",F34=\"Ja\"),D34*D7,0)+IF(AND(D11=\"Ja\",F35=\"Ja\"),D35*D7,0)+IF(AND(D11=\"Ja\",F36=\"Ja\"),D36*D7,0)+IF(AND(D11=\"Ja\",F37=\"Ja\"),D37*D7,0)+IF(AND(D11=\"Ja\",F38=\"Ja\"),D38*D7,0)+IF(AND(D11=\"Ja\",F39=\"Ja\"),D39*D7,0)+IF(AND(D11=\"Ja\",F40=\"Ja\"),D40*D7,0)+IF(AND(D11=\"Ja\",F29=\"Nej\"),D29* IF(D8>261,(IF(F29=\"Ja\",260-'Format ark'!D13,260)),IF(D8<=260,IF(F29=\"Ja\",D8-'Format ark'!D13,D8))),0)+IF(AND(D11=\"Ja\",F30=\"Nej\"),D30* IF(D8>261,(IF(F30=\"Ja\",260-'Format ark'!D13,260)),IF(D8<=260,IF(F30=\"Ja\",D8-'Format ark'!D13,D8))),0)+IF(AND(D11=\"Ja\",F31=\"Nej\"),D31* IF(D8>261,(IF(F31=\"Ja\",260-'Format ark'!D13,260)),IF(D8<=260,IF(F31=\"Ja\",D8-'Format ark'!D13,D8))),0)+IF(AND(D11=\"Ja\",F32=\"Nej\"),D32* IF(D8>261,(IF(F32=\"Ja\",260-'Format ark'!D13,260)),IF(D8<=260,IF(F32=\"Ja\",D8-'Format ark'!D13,D8))),0)+IF(AND(D11=\"Ja\",F33=\"Nej\"),D33* IF(D8>261,(IF(F33=\"Ja\",260-'Format ark'!D13,260)),IF(D8<=260,IF(F33=\"Ja\",D8-'Format ark'!D13,D8))),0)+IF(AND(D11=\"Ja\",F34=\"Nej\"),D34* IF(D8>261,(IF(F34=\"Ja\",260-'Format ark'!D13,260)),IF(D8<=260,IF(F34=\"Ja\",D8-'Format ark'!D13,D8))),0)+IF(AND(D11=\"Ja\",F35=\"Nej\"),D35* IF(D8>261,(IF(F35=\"Ja\",260-'Format ark'!D13,260)),IF(D8<=260,IF(F35=\"Ja\",D8-'Format ark'!D13,D8))),0)+IF(AND(D11=\"Ja\",F36=\"Nej\"),D36* IF(D8>261,(IF(F36=\"Ja\",260-'Format ark'!D13,260)),IF(D8<=260,IF(F36=\"Ja\",D8-'Format ark'!D13,D8))),0)+IF(AND(D11=\"Ja\",F37=\"Nej\"),D37* IF(D8>261,(IF(F37=\"Ja\",260-'Format ark'!D13,260)),IF(D8<=260,IF(F37=\"Ja\",D8-'Format ark'!D13,D8))),0)+IF(AND(D11=\"Ja\",F38=\"Nej\"),D38* IF(D8>261,(IF(F38=\"Ja\",260-'Format ark'!D13,260)),IF(D8<=260,IF(F38=\"Ja\",D8-'Format ark'!D13,D8))),0)+IF(AND(D11=\"Ja\",F39=\"Nej\"),D39* IF(D8>261,(IF(F39=\"Ja\",260-'Format ark'!D13,260)),IF(D8<=260,IF(F39=\"Ja\",D8-'Format ark'!D13,D8))),0)+IF(AND(D11=\"Ja\",F40=\"Nej\"),D40* IF(D8>261,(IF(F40=\"Ja\",260-'Format ark'!D13,260)),IF(D8<=260,IF(F40=\"Ja\",D8-'Format ark'!D13,D8))),0)","v":0}]
[null,"Estimeret VEU-godtgørelse",null,{"$f":"IF(AND(D11=\"Ja\",F29=\"Ja\"),D29*'Format ark'!D13,0)+IF(AND(D11=\"Ja\",F30=\"Ja\"),D30*'Format ark'!D13,0)+IF(AND(D11=\"Ja\",F31=\"Ja\"),D31*'Format ark'!D13,0)+IF(AND(D11=\"Ja\",F32=\"Ja\"),D32*('Format ark'!D13),0)+IF(AND(D11=\"Ja\",F33=\"Ja\"),D33*'Format ark'!D13,0)+IF(AND(D11=\"Ja\",F34=\"Ja\"),D34*'Format ark'!D13,0)+IF(AND(D11=\"Ja\",F35=\"Ja\"),D35*'Format ark'!D13,0)+IF(AND(D11=\"Ja\",F36=\"Ja\"),D36*'Format ark'!D13,0)+IF(AND(D11=\"Ja\",F37=\"Ja\"),D37*'Format ark'!D13,0)+IF(AND(D11=\"Ja\",F38=\"Ja\"),D38*'Format ark'!D13,0)+IF(AND(D11=\"Ja\",F39=\"Ja\"),D39*'Format ark'!D13,0)+IF(AND(D11=\"Ja\",F40=\"Ja\"),D40*'Format ark'!D13,0)","v":0}]
[null,"Samlet deltagerbetaling (udregner selv)",null,{"$f":"SUM(E29:E40)","v":0}]
[]
[null,"Praktik"]
[null,"Navn på virksomhed og p-nummer"]
[null,"Medarbejderens timeforbrug",null,null,{"$f":"IF(D48>C51*0.5,\"Praktik må maksimalt udgøre 50% af det samlede tidsforbrug.\",\" \")","v":" "}]
[null,"Samlet lønkompensation for praktikopholdet",null,{"$f":"IF(D48>C51*0.5,\"IKKE MULIGT\",D48*(IF(D8>261,260,D8)))","v":0}]
[]
[null,"Samlet tidsforbrug ",{"$f":"IF(D48+D41+D23>300,\"IKKE MULIGT\",D48+D41+D23)","v":0},{"$f":"IF(C51>300,\"Det maksimale tidsforbrug er 300 timer\",\" \")","v":" "}]
[]
[null,"Tidsforbrug til administration","Antal timer","Beløb"]
[null,"Der kan godtgøres op til 5 timer.",null,{"$f":"IF(C54>5,\"Der kan maksimalt godtgøres 5 timer pr. medarbejder.\",C54*260)","v":0}]
[]
[null,"Samlet tilsagnsramme i kr. (maksimal støtte til sporskiftepakken): ",null,{"$f":"IF(C51>300,0,MIN(D49+D44+D42+D26+D24+D54,120000))","v":0},{"$f":"IF(D56=120000,\"Det maksimale tilsagn pr. sporskiftepakke er nået, og det overstigende beløb er derfor selvbetaling.\",\"\")","v":""}]
[]
[]
[null,"Estimeret VEU-godtgørelse",null,{"$f":"D43+D25","v":0}]
[]
[null,"Selvbetaling i kr. (udgifter udover den øvre tilsagnsramme)",null,{"$f":"IF(C51>300,0,IF(D56=120000,D44+D26+D42+D49+D24+D54-120000,0))","v":0}]

{"sheet":"Medarbejder 7","index":7,"n_rows":61,"n_cols":6,"rows_kept":61,"cut":false,"hidden":true,"merged":[[6,1,6,2],[8,1,8,2],[7,1,7,2],[55,1,56,2],[8,4,8,5],[21,1,21,2],[9,1,9,2],[9,4,9,5],[10,1,10,2],[11,1,11,3],[12,1,12,3],[17,1,17,2],[18,1,18,2],[19,1,19,2],[20,1,20,2],[55,3,56,3],[16,1,16,2],[33,1,33,2],[34,1,34,2],[27,1,27,2],[28,1,28,2],[29,1,29,2],[30,1,30,2],[31,1,31,2],[32,1,32,2],[35,1,35,2],[36,1,36,2],[37,1,37,2],[38,1,38,2],[39,1,39,2]]}
[]
[null,null,"Budget/Regnskab for sporskiftepakken"]
[]
[null,null,"Oplysninger om medarbejderen"]
[]
[null,null,"Medarbejder 7"]
[null,"Medarbejderens lønkompensation fra sporskifte (kr./t.)",null,{"$f":"IF(D8>261,(IF(D11=\"Ja\",260-'Format ark'!D13,260)),IF(D8<=260,IF(D11=\"Ja\",IF(D8<'Format ark'!D13,0,D8-'Format ark'!D13),D8)))","v":0}]
[null,"Medarbejderens timesats (kr./t.)"]
[null,"Medarbejderens højst gennemførte uddannelse",null,null,{"$f":"IF(D9=\"\",\"Husk at vælge medarbejderens højst gennemførte uddannelse.\",\" \")","v":"Husk at vælge medarbejderens højst gennemførte uddannelse."}]
[null,"Har medarbejderen brugt sin uddannelse de senest 5 år?",null,null,{"$f":"IF(D10=\"\",\"Husk at svare på spørgsmålet.\",\" \")","v":"Husk at svare på spørgsmålet."}]
[null,"Medarbejder formodes at være berettiget til at få VEU-godtgørelse ",null,{"$f":"IF(OR(D9=\"Videregående uddannelse\",D9=\"Gymnasial uddannelse\")*AND(D10=\"ja\"),\"Nej\",\"Ja\")","v":"Ja"}]
[null,"Beskriv herunder hvad formålet med den planlagte sporskiftepakke er for medarbejderen:"]
[]
[]
[null,null,"Aktiviteter"]
[]
[null,"Afklaring, vejledning mv. \nSkriv navn på kursus",null,"Medarbejderens timeforbug (timer)","Evt. deltagerbetaling (kr.)","Giver kurset ret til VEU-godtgørelse?"]
[]
[]
[]
[]
[]
[null,"Samlet antal timer (udregner selv)",null,{"$f":"SUM(D18:D22)","v":0}]
[null,"Samlet lønkompensation udover evt. VEU-godtgørelse (udregner selv)",null,{"$f":"IF(D11=\"Nej\",D23*D7,0)+IF(AND(D11=\"Ja\",F18=\"Ja\"),D18*D7,0)+IF(AND(D11=\"Ja\",F19=\"Ja\"),D19*D7,0)+IF(AND(D11=\"Ja\",F20=\"Ja\"),D20*D7,0)+IF(AND(D11=\"Ja\",F21=\"Ja\"),D21*D7,0)+IF(AND(D11=\"Ja\",F22=\"Ja\"),D22*D7,0)+IF(AND(D11=\"Ja\",F18=\"Nej\"),D18*IF(D8>261,(IF(F18=\"Ja\",260-'Format ark'!D13,260)),IF(D8<=260,IF(F18=\"Ja\",D8-'Format ark'!D13,D8))),0)+IF(AND(D11=\"Ja\",F19=\"Nej\"),D19*IF(D8>261,(IF(F19=\"Ja\",260-'Format ark'!D13,260)),IF(D8<=260,IF(F19=\"Ja\",D8-'Format ark'!D13,D8))),0)+IF(AND(D11=\"Ja\",F20=\"Nej\"),D20*IF(D8>261,(IF(F20=\"Ja\",260-'Format ark'!D13,260)),IF(D8<=260,IF(F20=\"Ja\",D8-'Format ark'!D13,D8))),0)+IF(AND(D11=\"Ja\",F21=\"Nej\"),D21*IF(D8>261,(IF(F21=\"Ja\",260-'Format ark'!D13,260)),IF(D8<=260,IF(F21=\"Ja\",D8-'Format ark'!D13,D8))),0)+IF(AND(D11=\"Ja\",F22=\"Nej\"),D22*IF(D8>261,(IF(F22=\"Ja\",260-'Format ark'!D13,260)),IF(D8<=260,IF(F22=\"Ja\",D8-'Format ark'!D13,D8))),0)","v":0}]
[null,"Estimeret VEU-godtgørelse",null,{"$f":"IF(AND(D11=\"Ja\",F18=\"Ja\"),D18*'Format ark'!D13,0)+IF(AND(D11=\"Ja\",F19=\"Ja\"),D19*'Format ark'!D13,0)+IF(AND(D11=\"Ja\",F20=\"Ja\"),D20*'Format ark'!D13,0)+IF(AND(D11=\"Ja\",F21=\"Ja\"),D21*'Format ark'!D13,0)+IF(AND(D11=\"Ja\",F22=\"Ja\"),D22*'Format ark'!D13,0)","v":0}]
[null,"Samlet deltagerbeltaing (udregner selv)",null,{"$f":"SUM(E18:E22)","v":0}]
[]
[null,"Erhversrettet efteruddannelse\nSkriv navn på efteruddannelse",null,"Medarbejderens timeforbrug (timer)","Evt. deltagerbetaling (kr.)","Giver kurset ret til VEU-godtgørelse?"]
[]
[]
[]
[]
[]
[]
[]
[]
[]
[]
[]
[null,"Kørsel/transport (angives som faktisk udgift)",null,null,null,"Nej"]
[null,"Samlet antal timer (udregner selv)",null,{"$f":"SUM(D29:D40)","v":0}]
[null,"Samlet lønkompensation udover evt. VEU-godtgørelse (udregner selv)",null,{"$f":"IF(D11=\"Nej\",D41*D7,0)+IF(AND(D11=\"Ja\",F29=\"Ja\"),D29*D7,0)+IF(AND(D11=\"Ja\",F30=\"Ja\"),D30*D7,0)+IF(AND(D11=\"Ja\",F31=\"Ja\"),D31*D7,0)+IF(AND(D11=\"Ja\",F32=\"Ja\"),D32*D7,0)+IF(AND(D11=\"Ja\",F33=\"Ja\"),D33*D7,0)+IF(AND(D11=\"Ja\",F34=\"Ja\"),D34*D7,0)+IF(AND(D11=\"Ja\",F35=\"Ja\"),D35*D7,0)+IF(AND(D11=\"Ja\",F36=\"Ja\"),D36*D7,0)+IF(AND(D11=\"Ja\",F37=\"Ja\"),D37*D7,0)+IF(AND(D11=\"Ja\",F38=\"Ja\"),D38*D7,0)+IF(AND(D11=\"Ja\",F39=\"Ja\"),D39*D7,0)+IF(AND(D11=\"Ja\",F40=\"Ja\"),D40*D7,0)+IF(AND(D11=\"Ja\",F29=\"Nej\"),D29* IF(D8>261,(IF(F29=\"Ja\",260-'Format ark'!D13,260)),IF(D8<=260,IF(F29=\"Ja\",D8-'Format ark'!D13,D8))),0)+IF(AND(D11=\"Ja\",F30=\"Nej\"),D30* IF(D8>261,(IF(F30=\"Ja\",260-'Format ark'!D13,260)),IF(D8<=260,IF(F30=\"Ja\",D8-'Format ark'!D13,D8))),0)+IF(AND(D11=\"Ja\",F31=\"Nej\"),D31* IF(D8>261,(IF(F31=\"Ja\",260-'Format ark'!D13,260)),IF(D8<=260,IF(F31=\"Ja\",D8-'Format ark'!D13,D8))),0)+IF(AND(D11=\"Ja\",F32=\"Nej\"),D32* IF(D8>261,(IF(F32=\"Ja\",260-'Format ark'!D13,260)),IF(D8<=260,IF(F32=\"Ja\",D8-'Format ark'!D13,D8))),0)+IF(AND(D11=\"Ja\",F33=\"Nej\"),D33* IF(D8>261,(IF(F33=\"Ja\",260-'Format ark'!D13,260)),IF(D8<=260,IF(F33=\"Ja\",D8-'Format ark'!D13,D8))),0)+IF(AND(D11=\"Ja\",F34=\"Nej\"),D34* IF(D8>261,(IF(F34=\"Ja\",260-'Format ark'!D13,260)),IF(D8<=260,IF(F34=\"Ja\",D8-'Format ark'!D13,D8))),0)+IF(AND(D11=\"Ja\",F35=\"Nej\"),D35* IF(D8>261,(IF(F35=\"Ja\",260-'Format ark'!D13,260)),IF(D8<=260,IF(F35=\"Ja\",D8-'Format ark'!D13,D8))),0)+IF(AND(D11=\"Ja\",F36=\"Nej\"),D36* IF(D8>261,(IF(F36=\"Ja\",260-'Format ark'!D13,260)),IF(D8<=260,IF(F36=\"Ja\",D8-'Format ark'!D13,D8))),0)+IF(AND(D11=\"Ja\",F37=\"Nej\"),D37* IF(D8>261,(IF(F37=\"Ja\",260-'Format ark'!D13,260)),IF(D8<=260,IF(F37=\"Ja\",D8-'Format ark'!D13,D8))),0)+IF(AND(D11=\"Ja\",F38=\"Nej\"),D38* IF(D8>261,(IF(F38=\"Ja\",260-'Format ark'!D13,260)),IF(D8<=260,IF(F38=\"Ja\",D8-'Format ark'!D13,D8))),0)+IF(AND(D11=\"Ja\",F39=\"Nej\"),D39* IF(D8>261,(IF(F39=\"Ja\",260-'Format ark'!D13,260)),IF(D8<=260,IF(F39=\"Ja\",D8-'Format ark'!D13,D8))),0)+IF(AND(D11=\"Ja\",F40=\"Nej\"),D40* IF(D8>261,(IF(F40=\"Ja\",260-'Format ark'!D13,260)),IF(D8<=260,IF(F40=\"Ja\",D8-'Format ark'!D13,D8))),0)","v":0}]
[null,"Estimeret VEU-godtgørelse",null,{"$f":"IF(AND(D11=\"Ja\",F29=\"Ja\"),D29*'Format ark'!D13,0)+IF(AND(D11=\"Ja\",F30=\"Ja\"),D30*'Format ark'!D13,0)+IF(AND(D11=\"Ja\",F31=\"Ja\"),D31*'Format ark'!D13,0)+IF(AND(D11=\"Ja\",F32=\"Ja\"),D32*('Format ark'!D13),0)+IF(AND(D11=\"Ja\",F33=\"Ja\"),D33*'Format ark'!D13,0)+IF(AND(D11=\"Ja\",F34=\"Ja\"),D34*'Format ark'!D13,0)+IF(AND(D11=\"Ja\",F35=\"Ja\"),D35*'Format ark'!D13,0)+IF(AND(D11=\"Ja\",F36=\"Ja\"),D36*'Format ark'!D13,0)+IF(AND(D11=\"Ja\",F37=\"Ja\"),D37*'Format ark'!D13,0)+IF(AND(D11=\"Ja\",F38=\"Ja\"),D38*'Format ark'!D13,0)+IF(AND(D11=\"Ja\",F39=\"Ja\"),D39*'Format ark'!D13,0)+IF(AND(D11=\"Ja\",F40=\"Ja\"),D40*'Format ark'!D13,0)","v":0}]
[null,"Samlet deltagerbetaling (udregner selv)",null,{"$f":"SUM(E29:E40)","v":0}]
[]
[null,"Praktik"]
[null,"Navn på virksomhed og p-nummer"]
[null,"Medarbejderens timeforbrug",null,null,{"$f":"IF(D48>C51*0.5,\"Praktik må maksimalt udgøre 50% af det samlede tidsforbrug.\",\" \")","v":" "}]
[null,"Samlet lønkompensation for praktikopholdet",null,{"$f":"IF(D48>C51*0.5,\"IKKE MULIGT\",D48*(IF(D8>261,260,D8)))","v":0}]
[]
[null,"Samlet tidsforbrug ",{"$f":"IF(D48+D41+D23>300,\"IKKE MULIGT\",D48+D41+D23)","v":0},{"$f":"IF(C51>300,\"Det maksimale tidsforbrug er 300 timer\",\" \")","v":" "}]
[]
[null,"Tidsforbrug til administration","Antal timer","Beløb"]
[null,"Der kan godtgøres op til 5 timer.",null,{"$f":"IF(C54>5,\"Der kan maksimalt godtgøres 5 timer pr. medarbejder.\",C54*260)","v":0}]
[]
[null,"Samlet tilsagnsramme i kr. (maksimal støtte til sporskiftepakken): ",null,{"$f":"IF(C51>300,0,MIN(D49+D44+D42+D26+D24+D54,120000))","v":0},{"$f":"IF(D56=120000,\"Det maksimale tilsagn pr. sporskiftepakke er nået, og det overstigende beløb er derfor selvbetaling.\",\"\")","v":""}]
[]
[]
[null,"Estimeret VEU-godtgørelse",null,{"$f":"D43+D25","v":0}]
[]
[null,"Selvbetaling i kr. (udgifter udover den øvre tilsagnsramme)",null,{"$f":"IF(C51>300,0,IF(D56=120000,D44+D26+D42+D49+D24+D54-120000,0))","v":0}]

{"sheet":"Medarbejder 8","index":8,"n_rows":61,"n_cols":6,"rows_kept":61,"cut":false,"hidden":true,"merged":[[6,1,6,2],[8,1,8,2],[7,1,7,2],[55,1,56,2],[8,4,8,5],[21,1,21,2],[9,1,9,2],[9,4,9,5],[10,1,10,2],[11,1,11,3],[12,1,12,3],[17,1,17,2],[18,1,18,2],[19,1,19,2],[20,1,20,2],[55,3,56,3],[16,1,16,2],[33,1,33,2],[34,1,34,2],[27,1,27,2],[28,1,28,2],[29,1,29,2],[30,1,30,2],[31,1,31,2],[32,1,32,2],[35,1,35,2],[36,1,36,2],[37,1,37,2],[38,1,38,2],[39,1,39,2]]}
[]
[null,null,"Budget/Regnskab for sporskiftepakken"]
[]
[null,null,"Oplysninger om medarbejderen"]
[]
[null,null,"Medarbejder 8"]
[null,"Medarbejderens lønkompensation fra sporskifte (kr./t.)",null,{"$f":"IF(D8>261,(IF(D11=\"Ja\",260-'Format ark'!D13,260)),IF(D8<=260,IF(D11=\"Ja\",IF(D8<'Format ark'!D13,0,D8-'Format ark'!D13),D8)))","v":0}]
[null,"Medarbejderens timesats (kr./t.)"]
[null,"Medarbejderens højst gennemførte uddannelse",null,null,{"$f":"IF(D9=\"\",\"Husk at vælge medarbejderens højst gennemførte uddannelse.\",\" \")","v":"Husk at vælge medarbejderens højst gennemførte uddannelse."}]
[null,"Har medarbejderen brugt sin uddannelse de senest 5 år?",null,null,{"$f":"IF(D10=\"\",\"Husk at svare på spørgsmålet.\",\" \")","v":"Husk at svare på spørgsmålet."}]
[null,"Medarbejder formodes at være berettiget til at få VEU-godtgørelse ",null,{"$f":"IF(OR(D9=\"Videregående uddannelse\",D9=\"Gymnasial uddannelse\")*AND(D10=\"ja\"),\"Nej\",\"Ja\")","v":"Ja"}]
[null,"Beskriv herunder hvad formålet med den planlagte sporskiftepakke er for medarbejderen:"]
[]
[]
[null,null,"Aktiviteter"]
[]
[null,"Afklaring, vejledning mv. \nSkriv navn på kursus",null,"Medarbejderens timeforbug (timer)","Evt. deltagerbetaling (kr.)","Giver kurset ret til VEU-godtgørelse?"]
[]
[]
[]
[]
[]
[null,"Samlet antal timer (udregner selv)",null,{"$f":"SUM(D18:D22)","v":0}]
[null,"Samlet lønkompensation udover evt. VEU-godtgørelse (udregner selv)",null,{"$f":"IF(D11=\"Nej\",D23*D7,0)+IF(AND(D11=\"Ja\",F18=\"Ja\"),D18*D7,0)+IF(AND(D11=\"Ja\",F19=\"Ja\"),D19*D7,0)+IF(AND(D11=\"Ja\",F20=\"Ja\"),D20*D7,0)+IF(AND(D11=\"Ja\",F21=\"Ja\"),D21*D7,0)+IF(AND(D11=\"Ja\",F22=\"Ja\"),D22*D7,0)+IF(AND(D11=\"Ja\",F18=\"Nej\"),D18*IF(D8>261,(IF(F18=\"Ja\",260-'Format ark'!D13,260)),IF(D8<=260,IF(F18=\"Ja\",D8-'Format ark'!D13,D8))),0)+IF(AND(D11=\"Ja\",F19=\"Nej\"),D19*IF(D8>261,(IF(F19=\"Ja\",260-'Format ark'!D13,260)),IF(D8<=260,IF(F19=\"Ja\",D8-'Format ark'!D13,D8))),0)+IF(AND(D11=\"Ja\",F20=\"Nej\"),D20*IF(D8>261,(IF(F20=\"Ja\",260-'Format ark'!D13,260)),IF(D8<=260,IF(F20=\"Ja\",D8-'Format ark'!D13,D8))),0)+IF(AND(D11=\"Ja\",F21=\"Nej\"),D21*IF(D8>261,(IF(F21=\"Ja\",260-'Format ark'!D13,260)),IF(D8<=260,IF(F21=\"Ja\",D8-'Format ark'!D13,D8))),0)+IF(AND(D11=\"Ja\",F22=\"Nej\"),D22*IF(D8>261,(IF(F22=\"Ja\",260-'Format ark'!D13,260)),IF(D8<=260,IF(F22=\"Ja\",D8-'Format ark'!D13,D8))),0)","v":0}]
[null,"Estimeret VEU-godtgørelse",null,{"$f":"IF(AND(D11=\"Ja\",F18=\"Ja\"),D18*'Format ark'!D13,0)+IF(AND(D11=\"Ja\",F19=\"Ja\"),D19*'Format ark'!D13,0)+IF(AND(D11=\"Ja\",F20=\"Ja\"),D20*'Format ark'!D13,0)+IF(AND(D11=\"Ja\",F21=\"Ja\"),D21*'Format ark'!D13,0)+IF(AND(D11=\"Ja\",F22=\"Ja\"),D22*'Format ark'!D13,0)","v":0}]
[null,"Samlet deltagerbeltaing (udregner selv)",null,{"$f":"SUM(E18:E22)","v":0}]
[]
[null,"Erhversrettet efteruddannelse\nSkriv navn på efteruddannelse",null,"Medarbejderens timeforbrug (timer)","Evt. deltagerbetaling (kr.)","Giver kurset ret til VEU-godtgørelse?"]
[]
[]
[]
[]
[]
[]
[]
[]
[]
[]
[]
[null,"Kørsel/transport (angives som faktisk udgift)",null,null,null,"Nej"]
[null,"Samlet antal timer (udregner selv)",null,{"$f":"SUM(D29:D40)","v":0}]
[null,"Samlet lønkompensation udover evt. VEU-godtgørelse (udregner selv)",null,{"$f":"IF(D11=\"Nej\",D41*D7,0)+IF(AND(D11=\"Ja\",F29=\"Ja\"),D29*D7,0)+IF(AND(D11=\"Ja\",F30=\"Ja\"),D30*D7,0)+IF(AND(D11=\"Ja\",F31=\"Ja\"),D31*D7,0)+IF(AND(D11=\"Ja\",F32=\"Ja\"),D32*D7,0)+IF(AND(D11=\"Ja\",F33=\"Ja\"),D33*D7,0)+IF(AND(D11=\"Ja\",F34=\"Ja\"),D34*D7,0)+IF(AND(D11=\"Ja\",F35=\"Ja\"),D35*D7,0)+IF(AND(D11=\"Ja\",F36=\"Ja\"),D36*D7,0)+IF(AND(D11=\"Ja\",F37=\"Ja\"),D37*D7,0)+IF(AND(D11=\"Ja\",F38=\"Ja\"),D38*D7,0)+IF(AND(D11=\"Ja\",F39=\"Ja\"),D39*D7,0)+IF(AND(D11=\"Ja\",F40=\"Ja\"),D40*D7,0)+IF(AND(D11=\"Ja\",F29=\"Nej\"),D29* IF(D8>261,(IF(F29=\"Ja\",260-'Format ark'!D13,260)),IF(D8<=260,IF(F29=\"Ja\",D8-'Format ark'!D13,D8))),0)+IF(AND(D11=\"Ja\",F30=\"Nej\"),D30* IF(D8>261,(IF(F30=\"Ja\",260-'Format ark'!D13,260)),IF(D8<=260,IF(F30=\"Ja\",D8-'Format ark'!D13,D8))),0)+IF(AND(D11=\"Ja\",F31=\"Nej\"),D31* IF(D8>261,(IF(F31=\"Ja\",260-'Format ark'!D13,260)),IF(D8<=260,IF(F31=\"Ja\",D8-'Format ark'!D13,D8))),0)+IF(AND(D11=\"Ja\",F32=\"Nej\"),D32* IF(D8>261,(IF(F32=\"Ja\",260-'Format ark'!D13,260)),IF(D8<=260,IF(F32=\"Ja\",D8-'Format ark'!D13,D8))),0)+IF(AND(D11=\"Ja\",F33=\"Nej\"),D33* IF(D8>261,(IF(F33=\"Ja\",260-'Format ark'!D13,260)),IF(D8<=260,IF(F33=\"Ja\",D8-'Format ark'!D13,D8))),0)+IF(AND(D11=\"Ja\",F34=\"Nej\"),D34* IF(D8>261,(IF(F34=\"Ja\",260-'Format ark'!D13,260)),IF(D8<=260,IF(F34=\"Ja\",D8-'Format ark'!D13,D8))),0)+IF(AND(D11=\"Ja\",F35=\"Nej\"),D35* IF(D8>261,(IF(F35=\"Ja\",260-'Format ark'!D13,260)),IF(D8<=260,IF(F35=\"Ja\",D8-'Format ark'!D13,D8))),0)+IF(AND(D11=\"Ja\",F36=\"Nej\"),D36* IF(D8>261,(IF(F36=\"Ja\",260-'Format ark'!D13,260)),IF(D8<=260,IF(F36=\"Ja\",D8-'Format ark'!D13,D8))),0)+IF(AND(D11=\"Ja\",F37=\"Nej\"),D37* IF(D8>261,(IF(F37=\"Ja\",260-'Format ark'!D13,260)),IF(D8<=260,IF(F37=\"Ja\",D8-'Format ark'!D13,D8))),0)+IF(AND(D11=\"Ja\",F38=\"Nej\"),D38* IF(D8>261,(IF(F38=\"Ja\",260-'Format ark'!D13,260)),IF(D8<=260,IF(F38=\"Ja\",D8-'Format ark'!D13,D8))),0)+IF(AND(D11=\"Ja\",F39=\"Nej\"),D39* IF(D8>261,(IF(F39=\"Ja\",260-'Format ark'!D13,260)),IF(D8<=260,IF(F39=\"Ja\",D8-'Format ark'!D13,D8))),0)+IF(AND(D11=\"Ja\",F40=\"Nej\"),D40* IF(D8>261,(IF(F40=\"Ja\",260-'Format ark'!D13,260)),IF(D8<=260,IF(F40=\"Ja\",D8-'Format ark'!D13,D8))),0)","v":0}]
[null,"Estimeret VEU-godtgørelse",null,{"$f":"IF(AND(D11=\"Ja\",F29=\"Ja\"),D29*'Format ark'!D13,0)+IF(AND(D11=\"Ja\",F30=\"Ja\"),D30*'Format ark'!D13,0)+IF(AND(D11=\"Ja\",F31=\"Ja\"),D31*'Format ark'!D13,0)+IF(AND(D11=\"Ja\",F32=\"Ja\"),D32*('Format ark'!D13),0)+IF(AND(D11=\"Ja\",F33=\"Ja\"),D33*'Format ark'!D13,0)+IF(AND(D11=\"Ja\",F34=\"Ja\"),D34*'Format ark'!D13,0)+IF(AND(D11=\"Ja\",F35=\"Ja\"),D35*'Format ark'!D13,0)+IF(AND(D11=\"Ja\",F36=\"Ja\"),D36*'Format ark'!D13,0)+IF(AND(D11=\"Ja\",F37=\"Ja\"),D37*'Format ark'!D13,0)+IF(AND(D11=\"Ja\",F38=\"Ja\"),D38*'Format ark'!D13,0)+IF(AND(D11=\"Ja\",F39=\"Ja\"),D39*'Format ark'!D13,0)+IF(AND(D11=\"Ja\",F40=\"Ja\"),D40*'Format ark'!D13,0)","v":0}]
[null,"Samlet deltagerbetaling (udregner selv)",null,{"$f":"SUM(E29:E40)","v":0}]
[]
[null,"Praktik"]
[null,"Navn på virksomhed og p-nummer"]
[null,"Medarbejderens timeforbrug",null,null,{"$f":"IF(D48>C51*0.5,\"Praktik må maksimalt udgøre 50% af det samlede tidsforbrug.\",\" \")","v":" "}]
[null,"Samlet lønkompensation for praktikopholdet",null,{"$f":"IF(D48>C51*0.5,\"IKKE MULIGT\",D48*(IF(D8>261,260,D8)))","v":0}]
[]
[null,"Samlet tidsforbrug ",{"$f":"IF(D48+D41+D23>300,\"IKKE MULIGT\",D48+D41+D23)","v":0},{"$f":"IF(C51>300,\"Det maksimale tidsforbrug er 300 timer\",\" \")","v":" "}]
[]
[null,"Tidsforbrug til administration","Antal timer","Beløb"]
[null,"Der kan godtgøres op til 5 timer.",null,{"$f":"IF(C54>5,\"Der kan maksimalt godtgøres 5 timer pr. medarbejder.\",C54*260)","v":0}]
[]
[null,"Samlet tilsagnsramme i kr. (maksimal støtte til sporskiftepakken): ",null,{"$f":"IF(C51>300,0,MIN(D49+D44+D42+D26+D24+D54,120000))","v":0},{"$f":"IF(D56=120000,\"Det maksimale tilsagn pr. sporskiftepakke er nået, og det overstigende beløb er derfor selvbetaling.\",\"\")","v":""}]
[]
[]
[null,"Estimeret VEU-godtgørelse",null,{"$f":"D43+D25","v":0}]
[]
[null,"Selvbetaling i kr. (udgifter udover den øvre tilsagnsramme)",null,{"$f":"IF(C51>300,0,IF(D56=120000,D44+D26+D42+D49+D24+D54-120000,0))","v":0}]

{"sheet":"Medarbejder 9","index":9,"n_rows":61,"n_cols":6,"rows_kept":61,"cut":false,"hidden":true,"merged":[[6,1,6,2],[8,1,8,2],[7,1,7,2],[55,1,56,2],[8,4,8,5],[21,1,21,2],[9,1,9,2],[9,4,9,5],[10,1,10,2],[11,1,11,3],[12,1,12,3],[17,1,17,2],[18,1,18,2],[19,1,19,2],[20,1,20,2],[55,3,56,3],[16,1,16,2],[33,1,33,2],[34,1,34,2],[27,1,27,2],[28,1,28,2],[29,1,29,2],[30,1,30,2],[31,1,31,2],[32,1,32,2],[35,1,35,2],[36,1,36,2],[37,1,37,2],[38,1,38,2],[39,1,39,2]]}
[]
[null,null,"Budget/Regnskab for sporskiftepakken"]
[]
[null,null,"Oplysninger om medarbejderen"]
[]
[null,null,"Medarbejder 9"]
[null,"Medarbejderens lønkompensation fra sporskifte (kr./t.)",null,{"$f":"IF(D8>261,(IF(D11=\"Ja\",260-'Format ark'!D13,260)),IF(D8<=260,IF(D11=\"Ja\",IF(D8<'Format ark'!D13,0,D8-'Format ark'!D13),D8)))","v":0}]
[null,"Medarbejderens timesats (kr./t.)"]
[null,"Medarbejderens højst gennemførte uddannelse",null,null,{"$f":"IF(D9=\"\",\"Husk at vælge medarbejderens højst gennemførte uddannelse.\",\" \")","v":"Husk at vælge medarbejderens højst gennemførte uddannelse."}]
[null,"Har medarbejderen brugt sin uddannelse de senest 5 år?",null,null,{"$f":"IF(D10=\"\",\"Husk at svare på spørgsmålet.\",\" \")","v":"Husk at svare på spørgsmålet."}]
[null,"Medarbejder formodes at være berettiget til at få VEU-godtgørelse ",null,{"$f":"IF(OR(D9=\"Videregående uddannelse\",D9=\"Gymnasial uddannelse\")*AND(D10=\"ja\"),\"Nej\",\"Ja\")","v":"Ja"}]
[null,"Beskriv herunder hvad formålet med den planlagte sporskiftepakke er for medarbejderen:"]
[]
[]
[null,null,"Aktiviteter"]
[]
[null,"Afklaring, vejledning mv. \nSkriv navn på kursus",null,"Medarbejderens timeforbug (timer)","Evt. deltagerbetaling (kr.)","Giver kurset ret til VEU-godtgørelse?"]
[]
[]
[]
[]
[]
[null,"Samlet antal timer (udregner selv)",null,{"$f":"SUM(D18:D22)","v":0}]
[null,"Samlet lønkompensation udover evt. VEU-godtgørelse (udregner selv)",null,{"$f":"IF(D11=\"Nej\",D23*D7,0)+IF(AND(D11=\"Ja\",F18=\"Ja\"),D18*D7,0)+IF(AND(D11=\"Ja\",F19=\"Ja\"),D19*D7,0)+IF(AND(D11=\"Ja\",F20=\"Ja\"),D20*D7,0)+IF(AND(D11=\"Ja\",F21=\"Ja\"),D21*D7,0)+IF(AND(D11=\"Ja\",F22=\"Ja\"),D22*D7,0)+IF(AND(D11=\"Ja\",F18=\"Nej\"),D18*IF(D8>261,(IF(F18=\"Ja\",260-'Format ark'!D13,260)),IF(D8<=260,IF(F18=\"Ja\",D8-'Format ark'!D13,D8))),0)+IF(AND(D11=\"Ja\",F19=\"Nej\"),D19*IF(D8>261,(IF(F19=\"Ja\",260-'Format ark'!D13,260)),IF(D8<=260,IF(F19=\"Ja\",D8-'Format ark'!D13,D8))),0)+IF(AND(D11=\"Ja\",F20=\"Nej\"),D20*IF(D8>261,(IF(F20=\"Ja\",260-'Format ark'!D13,260)),IF(D8<=260,IF(F20=\"Ja\",D8-'Format ark'!D13,D8))),0)+IF(AND(D11=\"Ja\",F21=\"Nej\"),D21*IF(D8>261,(IF(F21=\"Ja\",260-'Format ark'!D13,260)),IF(D8<=260,IF(F21=\"Ja\",D8-'Format ark'!D13,D8))),0)+IF(AND(D11=\"Ja\",F22=\"Nej\"),D22*IF(D8>261,(IF(F22=\"Ja\",260-'Format ark'!D13,260)),IF(D8<=260,IF(F22=\"Ja\",D8-'Format ark'!D13,D8))),0)","v":0}]
[null,"Estimeret VEU-godtgørelse",null,{"$f":"IF(AND(D11=\"Ja\",F18=\"Ja\"),D18*'Format ark'!D13,0)+IF(AND(D11=\"Ja\",F19=\"Ja\"),D19*'Format ark'!D13,0)+IF(AND(D11=\"Ja\",F20=\"Ja\"),D20*'Format ark'!D13,0)+IF(AND(D11=\"Ja\",F21=\"Ja\"),D21*'Format ark'!D13,0)+IF(AND(D11=\"Ja\",F22=\"Ja\"),D22*'Format ark'!D13,0)","v":0}]
[null,"Samlet deltagerbeltaing (udregner selv)",null,{"$f":"SUM(E18:E22)","v":0}]
[]
[null,"Erhversrettet efteruddannelse\nSkriv navn på efteruddannelse",null,"Medarbejderens timeforbrug (timer)","Evt. deltagerbetaling (kr.)","Giver kurset ret til VEU-godtgørelse?"]
[]
[]
[]
[]
[]
[]
[]
[]
[]
[]
[]
[null,"Kørsel/transport (angives som faktisk udgift)",null,null,null,"Nej"]
[null,"Samlet antal timer (udregner selv)",null,{"$f":"SUM(D29:D40)","v":0}]
[null,"Samlet lønkompensation udover evt. VEU-godtgørelse (udregner selv)",null,{"$f":"IF(D11=\"Nej\",D41*D7,0)+IF(AND(D11=\"Ja\",F29=\"Ja\"),D29*D7,0)+IF(AND(D11=\"Ja\",F30=\"Ja\"),D30*D7,0)+IF(AND(D11=\"Ja\",F31=\"Ja\"),D31*D7,0)+IF(AND(D11=\"Ja\",F32=\"Ja\"),D32*D7,0)+IF(AND(D11=\"Ja\",F33=\"Ja\"),D33*D7,0)+IF(AND(D11=\"Ja\",F34=\"Ja\"),D34*D7,0)+IF(AND(D11=\"Ja\",F35=\"Ja\"),D35*D7,0)+IF(AND(D11=\"Ja\",F36=\"Ja\"),D36*D7,0)+IF(AND(D11=\"Ja\",F37=\"Ja\"),D37*D7,0)+IF(AND(D11=\"Ja\",F38=\"Ja\"),D38*D7,0)+IF(AND(D11=\"Ja\",F39=\"Ja\"),D39*D7,0)+IF(AND(D11=\"Ja\",F40=\"Ja\"),D40*D7,0)+IF(AND(D11=\"Ja\",F29=\"Nej\"),D29* IF(D8>261,(IF(F29=\"Ja\",260-'Format ark'!D13,260)),IF(D8<=260,IF(F29=\"Ja\",D8-'Format ark'!D13,D8))),0)+IF(AND(D11=\"Ja\",F30=\"Nej\"),D30* IF(D8>261,(IF(F30=\"Ja\",260-'Format ark'!D13,260)),IF(D8<=260,IF(F30=\"Ja\",D8-'Format ark'!D13,D8))),0)+IF(AND(D11=\"Ja\",F31=\"Nej\"),D31* IF(D8>261,(IF(F31=\"Ja\",260-'Format ark'!D13,260)),IF(D8<=260,IF(F31=\"Ja\",D8-'Format ark'!D13,D8))),0)+IF(AND(D11=\"Ja\",F32=\"Nej\"),D32* IF(D8>261,(IF(F32=\"Ja\",260-'Format ark'!D13,260)),IF(D8<=260,IF(F32=\"Ja\",D8-'Format ark'!D13,D8))),0)+IF(AND(D11=\"Ja\",F33=\"Nej\"),D33* IF(D8>261,(IF(F33=\"Ja\",260-'Format ark'!D13,260)),IF(D8<=260,IF(F33=\"Ja\",D8-'Format ark'!D13,D8))),0)+IF(AND(D11=\"Ja\",F34=\"Nej\"),D34* IF(D8>261,(IF(F34=\"Ja\",260-'Format ark'!D13,260)),IF(D8<=260,IF(F34=\"Ja\",D8-'Format ark'!D13,D8))),0)+IF(AND(D11=\"Ja\",F35=\"Nej\"),D35* IF(D8>261,(IF(F35=\"Ja\",260-'Format ark'!D13,260)),IF(D8<=260,IF(F35=\"Ja\",D8-'Format ark'!D13,D8))),0)+IF(AND(D11=\"Ja\",F36=\"Nej\"),D36* IF(D8>261,(IF(F36=\"Ja\",260-'Format ark'!D13,260)),IF(D8<=260,IF(F36=\"Ja\",D8-'Format ark'!D13,D8))),0)+IF(AND(D11=\"Ja\",F37=\"Nej\"),D37* IF(D8>261,(IF(F37=\"Ja\",260-'Format ark'!D13,260)),IF(D8<=260,IF(F37=\"Ja\",D8-'Format ark'!D13,D8))),0)+IF(AND(D11=\"Ja\",F38=\"Nej\"),D38* IF(D8>261,(IF(F38=\"Ja\",260-'Format ark'!D13,260)),IF(D8<=260,IF(F38=\"Ja\",D8-'Format ark'!D13,D8))),0)+IF(AND(D11=\"Ja\",F39=\"Nej\"),D39* IF(D8>261,(IF(F39=\"Ja\",260-'Format ark'!D13,260)),IF(D8<=260,IF(F39=\"Ja\",D8-'Format ark'!D13,D8))),0)+IF(AND(D11=\"Ja\",F40=\"Nej\"),D40* IF(D8>261,(IF(F40=\"Ja\",260-'Format ark'!D13,260)),IF(D8<=260,IF(F40=\"Ja\",D8-'Format ark'!D13,D8))),0)","v":0}]
[null,"Estimeret VEU-godtgørelse",null,{"$f":"IF(AND(D11=\"Ja\",F29=\"Ja\"),D29*'Format ark'!D13,0)+IF(AND(D11=\"Ja\",F30=\"Ja\"),D30*'Format ark'!D13,0)+IF(AND(D11=\"Ja\",F31=\"Ja\"),D31*'Format ark'!D13,0)+IF(AND(D11=\"Ja\",F32=\"Ja\"),D32*('Format ark'!D13),0)+IF(AND(D11=\"Ja\",F33=\"Ja\"),D33*'Format ark'!D13,0)+IF(AND(D11=\"Ja\",F34=\"Ja\"),D34*'Format ark'!D13,0)+IF(AND(D11=\"Ja\",F35=\"Ja\"),D35*'Format ark'!D13,0)+IF(AND(D11=\"Ja\",F36=\"Ja\"),D36*'Format ark'!D13,0)+IF(AND(D11=\"Ja\",F37=\"Ja\"),D37*'Format ark'!D13,0)+IF(AND(D11=\"Ja\",F38=\"Ja\"),D38*'Format ark'!D13,0)+IF(AND(D11=\"Ja\",F39=\"Ja\"),D39*'Format ark'!D13,0)+IF(AND(D11=\"Ja\",F40=\"Ja\"),D40*'Format ark'!D13,0)","v":0}]
[null,"Samlet deltagerbetaling (udregner selv)",null,{"$f":"SUM(E29:E40)","v":0}]
[]
[null,"Praktik"]
[null,"Navn på virksomhed og p-nummer"]
[null,"Medarbejderens timeforbrug",null,null,{"$f":"IF(D48>C51*0.5,\"Praktik må maksimalt udgøre 50% af det samlede tidsforbrug.\",\" \")","v":" "}]
[null,"Samlet lønkompensation for praktikopholdet",null,{"$f":"IF(D48>C51*0.5,\"IKKE MULIGT\",D48*(IF(D8>261,260,D8)))","v":0}]
[]
[null,"Samlet tidsforbrug ",{"$f":"IF(D48+D41+D23>300,\"IKKE MULIGT\",D48+D41+D23)","v":0},{"$f":"IF(C51>300,\"Det maksimale tidsforbrug er 300 timer\",\" \")","v":" "}]
[]
[null,"Tidsforbrug til administration","Antal timer","Beløb"]
[null,"Der kan godtgøres op til 5 timer.",null,{"$f":"IF(C54>5,\"Der kan maksimalt godtgøres 5 timer pr. medarbejder.\",C54*260)","v":0}]
[]
[null,"Samlet tilsagnsramme i kr. (maksimal støtte til sporskiftepakken): ",null,{"$f":"IF(C51>300,0,MIN(D49+D44+D42+D26+D24+D54,120000))","v":0},{"$f":"IF(D56=120000,\"Det maksimale tilsagn pr. sporskiftepakke er nået, og det overstigende beløb er derfor selvbetaling.\",\"\")","v":""}]
[]
[]
[null,"Estimeret VEU-godtgørelse",null,{"$f":"D43+D25","v":0}]
[]
[null,"Selvbetaling i kr. (udgifter udover den øvre tilsagnsramme)",null,{"$f":"IF(C51>300,0,IF(D56=120000,D44+D26+D42+D49+D24+D54-120000,0))","v":0}]

{"sheet":"Medarbejder 10","index":10,"n_rows":61,"n_cols":6,"rows_kept":61,"cut":false,"hidden":true,"merged":[[6,1,6,2],[8,1,8,2],[7,1,7,2],[55,1,56,2],[8,4,8,5],[21,1,21,2],[9,1,9,2],[9,4,9,5],[10,1,10,2],[11,1,11,3],[12,1,12,3],[17,1,17,2],[18,1,18,2],[19,1,19,2],[20,1,20,2],[55,3,56,3],[16,1,16,2],[33,1,33,2],[34,1,34,2],[27,1,27,2],[28,1,28,2],[29,1,29,2],[30,1,30,2],[31,1,31,2],[32,1,32,2],[35,1,35,2],[36,1,36,2],[37,1,37,2],[38,1,38,2],[39,1,39,2]]}
[{"$f":"Vejledning!P21","v":0}]
[null,null,"Budget/Regnskab for sporskiftepakken"]
[]
[null,null,"Oplysninger om medarbejderen"]
[]
[null,null,"Medarbejder 10"]
[null,"Medarbejderens lønkompensation fra sporskifte (kr./t.)",null,{"$f":"IF(D8>261,(IF(D11=\"Ja\",260-'Format ark'!D13,260)),IF(D8<=260,IF(D11=\"Ja\",IF(D8<'Format ark'!D13,0,D8-'Format ark'!D13),D8)))","v":0}]
[null,"Medarbejderens timesats (kr./t.)"]
[null,"Medarbejderens højst gennemførte uddannelse",null,null,{"$f":"IF(D9=\"\",\"Husk at vælge medarbejderens højst gennemførte uddannelse.\",\" \")","v":"Husk at vælge medarbejderens højst gennemførte uddannelse."}]
[null,"Har medarbejderen brugt sin uddannelse de senest 5 år?",null,null,{"$f":"IF(D10=\"\",\"Husk at svare på spørgsmålet.\",\" \")","v":"Husk at svare på spørgsmålet."}]
[null,"Medarbejder formodes at være berettiget til at få VEU-godtgørelse ",null,{"$f":"IF(OR(D9=\"Videregående uddannelse\",D9=\"Gymnasial uddannelse\")*AND(D10=\"ja\"),\"Nej\",\"Ja\")","v":"Ja"}]
[null,"Beskriv herunder hvad formålet med den planlagte sporskiftepakke er for medarbejderen:"]
[]
[]
[null,null,"Aktiviteter"]
[]
[null,"Afklaring, vejledning mv. \nSkriv navn på kursus",null,"Medarbejderens timeforbug (timer)","Evt. deltagerbetaling (kr.)","Giver kurset ret til VEU-godtgørelse?"]
[]
[]
[]
[]
[]
[null,"Samlet antal timer (udregner selv)",null,{"$f":"SUM(D18:D22)","v":0}]
[null,"Samlet lønkompensation udover evt. VEU-godtgørelse (udregner selv)",null,{"$f":"IF(D11=\"Nej\",D23*D7,0)+IF(AND(D11=\"Ja\",F18=\"Ja\"),D18*D7,0)+IF(AND(D11=\"Ja\",F19=\"Ja\"),D19*D7,0)+IF(AND(D11=\"Ja\",F20=\"Ja\"),D20*D7,0)+IF(AND(D11=\"Ja\",F21=\"Ja\"),D21*D7,0)+IF(AND(D11=\"Ja\",F22=\"Ja\"),D22*D7,0)+IF(AND(D11=\"Ja\",F18=\"Nej\"),D18*IF(D8>261,(IF(F18=\"Ja\",260-'Format ark'!D13,260)),IF(D8<=260,IF(F18=\"Ja\",D8-'Format ark'!D13,D8))),0)+IF(AND(D11=\"Ja\",F19=\"Nej\"),D19*IF(D8>261,(IF(F19=\"Ja\",260-'Format ark'!D13,260)),IF(D8<=260,IF(F19=\"Ja\",D8-'Format ark'!D13,D8))),0)+IF(AND(D11=\"Ja\",F20=\"Nej\"),D20*IF(D8>261,(IF(F20=\"Ja\",260-'Format ark'!D13,260)),IF(D8<=260,IF(F20=\"Ja\",D8-'Format ark'!D13,D8))),0)+IF(AND(D11=\"Ja\",F21=\"Nej\"),D21*IF(D8>261,(IF(F21=\"Ja\",260-'Format ark'!D13,260)),IF(D8<=260,IF(F21=\"Ja\",D8-'Format ark'!D13,D8))),0)+IF(AND(D11=\"Ja\",F22=\"Nej\"),D22*IF(D8>261,(IF(F22=\"Ja\",260-'Format ark'!D13,260)),IF(D8<=260,IF(F22=\"Ja\",D8-'Format ark'!D13,D8))),0)","v":0}]
[null,"Estimeret VEU-godtgørelse",null,{"$f":"IF(AND(D11=\"Ja\",F18=\"Ja\"),D18*'Format ark'!D13,0)+IF(AND(D11=\"Ja\",F19=\"Ja\"),D19*'Format ark'!D13,0)+IF(AND(D11=\"Ja\",F20=\"Ja\"),D20*'Format ark'!D13,0)+IF(AND(D11=\"Ja\",F21=\"Ja\"),D21*'Format ark'!D13,0)+IF(AND(D11=\"Ja\",F22=\"Ja\"),D22*'Format ark'!D13,0)","v":0}]
[null,"Samlet deltagerbeltaing (udregner selv)",null,{"$f":"SUM(E18:E22)","v":0}]
[]
[null,"Erhversrettet efteruddannelse\nSkriv navn på efteruddannelse",null,"Medarbejderens timeforbrug (timer)","Evt. deltagerbetaling (kr.)","Giver kurset ret til VEU-godtgørelse?"]
[]
[]
[]
[]
[]
[]
[]
[]
[]
[]
[]
[null,"Kørsel/transport (angives som faktisk udgift)",null,null,null,"Nej"]
[null,"Samlet antal timer (udregner selv)",null,{"$f":"SUM(D29:D40)","v":0}]
[null,"Samlet lønkompensation udover evt. VEU-godtgørelse (udregner selv)",null,{"$f":"IF(D11=\"Nej\",D41*D7,0)+IF(AND(D11=\"Ja\",F29=\"Ja\"),D29*D7,0)+IF(AND(D11=\"Ja\",F30=\"Ja\"),D30*D7,0)+IF(AND(D11=\"Ja\",F31=\"Ja\"),D31*D7,0)+IF(AND(D11=\"Ja\",F32=\"Ja\"),D32*D7,0)+IF(AND(D11=\"Ja\",F33=\"Ja\"),D33*D7,0)+IF(AND(D11=\"Ja\",F34=\"Ja\"),D34*D7,0)+IF(AND(D11=\"Ja\",F35=\"Ja\"),D35*D7,0)+IF(AND(D11=\"Ja\",F36=\"Ja\"),D36*D7,0)+IF(AND(D11=\"Ja\",F37=\"Ja\"),D37*D7,0)+IF(AND(D11=\"Ja\",F38=\"Ja\"),D38*D7,0)+IF(AND(D11=\"Ja\",F39=\"Ja\"),D39*D7,0)+IF(AND(D11=\"Ja\",F40=\"Ja\"),D40*D7,0)+IF(AND(D11=\"Ja\",F29=\"Nej\"),D29* IF(D8>261,(IF(F29=\"Ja\",260-'Format ark'!D13,260)),IF(D8<=260,IF(F29=\"Ja\",D8-'Format ark'!D13,D8))),0)+IF(AND(D11=\"Ja\",F30=\"Nej\"),D30* IF(D8>261,(IF(F30=\"Ja\",260-'Format ark'!D13,260)),IF(D8<=260,IF(F30=\"Ja\",D8-'Format ark'!D13,D8))),0)+IF(AND(D11=\"Ja\",F31=\"Nej\"),D31* IF(D8>261,(IF(F31=\"Ja\",260-'Format ark'!D13,260)),IF(D8<=260,IF(F31=\"Ja\",D8-'Format ark'!D13,D8))),0)+IF(AND(D11=\"Ja\",F32=\"Nej\"),D32* IF(D8>261,(IF(F32=\"Ja\",260-'Format ark'!D13,260)),IF(D8<=260,IF(F32=\"Ja\",D8-'Format ark'!D13,D8))),0)+IF(AND(D11=\"Ja\",F33=\"Nej\"),D33* IF(D8>261,(IF(F33=\"Ja\",260-'Format ark'!D13,260)),IF(D8<=260,IF(F33=\"Ja\",D8-'Format ark'!D13,D8))),0)+IF(AND(D11=\"Ja\",F34=\"Nej\"),D34* IF(D8>261,(IF(F34=\"Ja\",260-'Format ark'!D13,260)),IF(D8<=260,IF(F34=\"Ja\",D8-'Format ark'!D13,D8))),0)+IF(AND(D11=\"Ja\",F35=\"Nej\"),D35* IF(D8>261,(IF(F35=\"Ja\",260-'Format ark'!D13,260)),IF(D8<=260,IF(F35=\"Ja\",D8-'Format ark'!D13,D8))),0)+IF(AND(D11=\"Ja\",F36=\"Nej\"),D36* IF(D8>261,(IF(F36=\"Ja\",260-'Format ark'!D13,260)),IF(D8<=260,IF(F36=\"Ja\",D8-'Format ark'!D13,D8))),0)+IF(AND(D11=\"Ja\",F37=\"Nej\"),D37* IF(D8>261,(IF(F37=\"Ja\",260-'Format ark'!D13,260)),IF(D8<=260,IF(F37=\"Ja\",D8-'Format ark'!D13,D8))),0)+IF(AND(D11=\"Ja\",F38=\"Nej\"),D38* IF(D8>261,(IF(F38=\"Ja\",260-'Format ark'!D13,260)),IF(D8<=260,IF(F38=\"Ja\",D8-'Format ark'!D13,D8))),0)+IF(AND(D11=\"Ja\",F39=\"Nej\"),D39* IF(D8>261,(IF(F39=\"Ja\",260-'Format ark'!D13,260)),IF(D8<=260,IF(F39=\"Ja\",D8-'Format ark'!D13,D8))),0)+IF(AND(D11=\"Ja\",F40=\"Nej\"),D40* IF(D8>261,(IF(F40=\"Ja\",260-'Format ark'!D13,260)),IF(D8<=260,IF(F40=\"Ja\",D8-'Format ark'!D13,D8))),0)","v":0}]
[null,"Estimeret VEU-godtgørelse",null,{"$f":"IF(AND(D11=\"Ja\",F29=\"Ja\"),D29*'Format ark'!D13,0)+IF(AND(D11=\"Ja\",F30=\"Ja\"),D30*'Format ark'!D13,0)+IF(AND(D11=\"Ja\",F31=\"Ja\"),D31*'Format ark'!D13,0)+IF(AND(D11=\"Ja\",F32=\"Ja\"),D32*('Format ark'!D13),0)+IF(AND(D11=\"Ja\",F33=\"Ja\"),D33*'Format ark'!D13,0)+IF(AND(D11=\"Ja\",F34=\"Ja\"),D34*'Format ark'!D13,0)+IF(AND(D11=\"Ja\",F35=\"Ja\"),D35*'Format ark'!D13,0)+IF(AND(D11=\"Ja\",F36=\"Ja\"),D36*'Format ark'!D13,0)+IF(AND(D11=\"Ja\",F37=\"Ja\"),D37*'Format ark'!D13,0)+IF(AND(D11=\"Ja\",F38=\"Ja\"),D38*'Format ark'!D13,0)+IF(AND(D11=\"Ja\",F39=\"Ja\"),D39*'Format ark'!D13,0)+IF(AND(D11=\"Ja\",F40=\"Ja\"),D40*'Format ark'!D13,0)","v":0}]
[null,"Samlet deltagerbetaling (udregner selv)",null,{"$f":"SUM(E29:E40)","v":0}]
[]
[null,"Praktik"]
[null,"Navn på virksomhed og p-nummer"]
[null,"Medarbejderens timeforbrug",null,null,{"$f":"IF(D48>C51*0.5,\"Praktik må maksimalt udgøre 50% af det samlede tidsforbrug.\",\" \")","v":" "}]
[null,"Samlet lønkompensation for praktikopholdet",null,{"$f":"IF(D48>C51*0.5,\"IKKE MULIGT\",D48*(IF(D8>261,260,D8)))","v":0}]
[]
[null,"Samlet tidsforbrug ",{"$f":"IF(D48+D41+D23>300,\"IKKE MULIGT\",D48+D41+D23)","v":0},{"$f":"IF(C51>300,\"Det maksimale tidsforbrug er 300 timer\",\" \")","v":" "}]
[]
[null,"Tidsforbrug til administration","Antal timer","Beløb"]
[null,"Der kan godtgøres op til 5 timer.",null,{"$f":"IF(C54>5,\"Der kan maksimalt godtgøres 5 timer pr. medarbejder.\",C54*260)","v":0}]
[]
[null,"Samlet tilsagnsramme i kr. (maksimal støtte til sporskiftepakken): ",null,{"$f":"IF(C51>300,0,MIN(D49+D44+D42+D26+D24+D54,120000))","v":0},{"$f":"IF(D56=120000,\"Det maksimale tilsagn pr. sporskiftepakke er nået, og det overstigende beløb er derfor selvbetaling.\",\"\")","v":""}]
[]
[]
[null,"Estimeret VEU-godtgørelse",null,{"$f":"D43+D25","v":0}]
[]
[null,"Selvbetaling i kr. (udgifter udover den øvre tilsagnsramme)",null,{"$f":"IF(C51>300,0,IF(D56=120000,D44+D26+D42+D49+D24+D54-120000,0))","v":0}]

{"sheet":"Medarbejder 11","index":11,"n_rows":61,"n_cols":6,"rows_kept":61,"cut":false,"hidden":true,"merged":[[6,1,6,2],[8,1,8,2],[7,1,7,2],[55,1,56,2],[8,4,8,5],[21,1,21,2],[9,1,9,2],[9,4,9,5],[10,1,10,2],[11,1,11,3],[12,1,12,3],[17,1,17,2],[18,1,18,2],[19,1,19,2],[20,1,20,2],[55,3,56,3],[16,1,16,2],[33,1,33,2],[34,1,34,2],[27,1,27,2],[28,1,28,2],[29,1,29,2],[30,1,30,2],[31,1,31,2],[32,1,32,2],[35,1,35,2],[36,1,36,2],[37,1,37,2],[38,1,38,2],[39,1,39,2]]}
[]
[null,null,"Budget/Regnskab for sporskiftepakken"]
[]
[null,null,"Oplysninger om medarbejderen"]
[]
[null,null,"Medarbejder 11"]
[null,"Medarbejderens lønkompensation fra sporskifte (kr./t.)",null,{"$f":"IF(D8>261,(IF(D11=\"Ja\",260-'Format ark'!D13,260)),IF(D8<=260,IF(D11=\"Ja\",IF(D8<'Format ark'!D13,0,D8-'Format ark'!D13),D8)))","v":0}]
[null,"Medarbejderens timesats (kr./t.)"]
[null,"Medarbejderens højst gennemførte uddannelse",null,null,{"$f":"IF(D9=\"\",\"Husk at vælge medarbejderens højst gennemførte uddannelse.\",\" \")","v":"Husk at vælge medarbejderens højst gennemførte uddannelse."}]
[null,"Har medarbejderen brugt sin uddannelse de senest 5 år?",null,null,{"$f":"IF(D10=\"\",\"Husk at svare på spørgsmålet.\",\" \")","v":"Husk at svare på spørgsmålet."}]
[null,"Medarbejder formodes at være berettiget til at få VEU-godtgørelse ",null,{"$f":"IF(OR(D9=\"Videregående uddannelse\",D9=\"Gymnasial uddannelse\")*AND(D10=\"ja\"),\"Nej\",\"Ja\")","v":"Ja"}]
[null,"Beskriv herunder hvad formålet med den planlagte sporskiftepakke er for medarbejderen:"]
[]
[]
[null,null,"Aktiviteter"]
[]
[null,"Afklaring, vejledning mv. \nSkriv navn på kursus",null,"Medarbejderens timeforbug (timer)","Evt. deltagerbetaling (kr.)","Giver kurset ret til VEU-godtgørelse?"]
[]
[]
[]
[]
[]
[null,"Samlet antal timer (udregner selv)",null,{"$f":"SUM(D18:D22)","v":0}]
[null,"Samlet lønkompensation udover evt. VEU-godtgørelse (udregner selv)",null,{"$f":"IF(D11=\"Nej\",D23*D7,0)+IF(AND(D11=\"Ja\",F18=\"Ja\"),D18*D7,0)+IF(AND(D11=\"Ja\",F19=\"Ja\"),D19*D7,0)+IF(AND(D11=\"Ja\",F20=\"Ja\"),D20*D7,0)+IF(AND(D11=\"Ja\",F21=\"Ja\"),D21*D7,0)+IF(AND(D11=\"Ja\",F22=\"Ja\"),D22*D7,0)+IF(AND(D11=\"Ja\",F18=\"Nej\"),D18*IF(D8>261,(IF(F18=\"Ja\",260-'Format ark'!D13,260)),IF(D8<=260,IF(F18=\"Ja\",D8-'Format ark'!D13,D8))),0)+IF(AND(D11=\"Ja\",F19=\"Nej\"),D19*IF(D8>261,(IF(F19=\"Ja\",260-'Format ark'!D13,260)),IF(D8<=260,IF(F19=\"Ja\",D8-'Format ark'!D13,D8))),0)+IF(AND(D11=\"Ja\",F20=\"Nej\"),D20*IF(D8>261,(IF(F20=\"Ja\",260-'Format ark'!D13,260)),IF(D8<=260,IF(F20=\"Ja\",D8-'Format ark'!D13,D8))),0)+IF(AND(D11=\"Ja\",F21=\"Nej\"),D21*IF(D8>261,(IF(F21=\"Ja\",260-'Format ark'!D13,260)),IF(D8<=260,IF(F21=\"Ja\",D8-'Format ark'!D13,D8))),0)+IF(AND(D11=\"Ja\",F22=\"Nej\"),D22*IF(D8>261,(IF(F22=\"Ja\",260-'Format ark'!D13,260)),IF(D8<=260,IF(F22=\"Ja\",D8-'Format ark'!D13,D8))),0)","v":0}]
[null,"Estimeret VEU-godtgørelse",null,{"$f":"IF(AND(D11=\"Ja\",F18=\"Ja\"),D18*'Format ark'!D13,0)+IF(AND(D11=\"Ja\",F19=\"Ja\"),D19*'Format ark'!D13,0)+IF(AND(D11=\"Ja\",F20=\"Ja\"),D20*'Format ark'!D13,0)+IF(AND(D11=\"Ja\",F21=\"Ja\"),D21*'Format ark'!D13,0)+IF(AND(D11=\"Ja\",F22=\"Ja\"),D22*'Format ark'!D13,0)","v":0}]
[null,"Samlet deltagerbeltaing (udregner selv)",null,{"$f":"SUM(E18:E22)","v":0}]
[]
[null,"Erhversrettet efteruddannelse\nSkriv navn på efteruddannelse",null,"Medarbejderens timeforbrug (timer)","Evt. deltagerbetaling (kr.)","Giver kurset ret til VEU-godtgørelse?"]
[]
[]
[]
[]
[]
[]
[]
[]
[]
[]
[]
[null,"Kørsel/transport (angives som faktisk udgift)",null,null,null,"Nej"]
[null,"Samlet antal timer (udregner selv)",null,{"$f":"SUM(D29:D40)","v":0}]
[null,"Samlet lønkompensation udover evt. VEU-godtgørelse (udregner selv)",null,{"$f":"IF(D11=\"Nej\",D41*D7,0)+IF(AND(D11=\"Ja\",F29=\"Ja\"),D29*D7,0)+IF(AND(D11=\"Ja\",F30=\"Ja\"),D30*D7,0)+IF(AND(D11=\"Ja\",F31=\"Ja\"),D31*D7,0)+IF(AND(D11=\"Ja\",F32=\"Ja\"),D32*D7,0)+IF(AND(D11=\"Ja\",F33=\"Ja\"),D33*D7,0)+IF(AND(D11=\"Ja\",F34=\"Ja\"),D34*D7,0)+IF(AND(D11=\"Ja\",F35=\"Ja\"),D35*D7,0)+IF(AND(D11=\"Ja\",F36=\"Ja\"),D36*D7,0)+IF(AND(D11=\"Ja\",F37=\"Ja\"),D37*D7,0)+IF(AND(D11=\"Ja\",F38=\"Ja\"),D38*D7,0)+IF(AND(D11=\"Ja\",F39=\"Ja\"),D39*D7,0)+IF(AND(D11=\"Ja\",F40=\"Ja\"),D40*D7,0)+IF(AND(D11=\"Ja\",F29=\"Nej\"),D29* IF(D8>261,(IF(F29=\"Ja\",260-'Format ark'!D13,260)),IF(D8<=260,IF(F29=\"Ja\",D8-'Format ark'!D13,D8))),0)+IF(AND(D11=\"Ja\",F30=\"Nej\"),D30* IF(D8>261,(IF(F30=\"Ja\",260-'Format ark'!D13,260)),IF(D8<=260,IF(F30=\"Ja\",D8-'Format ark'!D13,D8))),0)+IF(AND(D11=\"Ja\",F31=\"Nej\"),D31* IF(D8>261,(IF(F31=\"Ja\",260-'Format ark'!D13,260)),IF(D8<=260,IF(F31=\"Ja\",D8-'Format ark'!D13,D8))),0)+IF(AND(D11=\"Ja\",F32=\"Nej\"),D32* IF(D8>261,(IF(F32=\"Ja\",260-'Format ark'!D13,260)),IF(D8<=260,IF(F32=\"Ja\",D8-'Format ark'!D13,D8))),0)+IF(AND(D11=\"Ja\",F33=\"Nej\"),D33* IF(D8>261,(IF(F33=\"Ja\",260-'Format ark'!D13,260)),IF(D8<=260,IF(F33=\"Ja\",D8-'Format ark'!D13,D8))),0)+IF(AND(D11=\"Ja\",F34=\"Nej\"),D34* IF(D8>261,(IF(F34=\"Ja\",260-'Format ark'!D13,260)),IF(D8<=260,IF(F34=\"Ja\",D8-'Format ark'!D13,D8))),0)+IF(AND(D11=\"Ja\",F35=\"Nej\"),D35* IF(D8>261,(IF(F35=\"Ja\",260-'Format ark'!D13,260)),IF(D8<=260,IF(F35=\"Ja\",D8-'Format ark'!D13,D8))),0)+IF(AND(D11=\"Ja\",F36=\"Nej\"),D36* IF(D8>261,(IF(F36=\"Ja\",260-'Format ark'!D13,260)),IF(D8<=260,IF(F36=\"Ja\",D8-'Format ark'!D13,D8))),0)+IF(AND(D11=\"Ja\",F37=\"Nej\"),D37* IF(D8>261,(IF(F37=\"Ja\",260-'Format ark'!D13,260)),IF(D8<=260,IF(F37=\"Ja\",D8-'Format ark'!D13,D8))),0)+IF(AND(D11=\"Ja\",F38=\"Nej\"),D38* IF(D8>261,(IF(F38=\"Ja\",260-'Format ark'!D13,260)),IF(D8<=260,IF(F38=\"Ja\",D8-'Format ark'!D13,D8))),0)+IF(AND(D11=\"Ja\",F39=\"Nej\"),D39* IF(D8>261,(IF(F39=\"Ja\",260-'Format ark'!D13,260)),IF(D8<=260,IF(F39=\"Ja\",D8-'Format ark'!D13,D8))),0)+IF(AND(D11=\"Ja\",F40=\"Nej\"),D40* IF(D8>261,(IF(F40=\"Ja\",260-'Format ark'!D13,260)),IF(D8<=260,IF(F40=\"Ja\",D8-'Format ark'!D13,D8))),0)","v":0}]
[null,"Estimeret VEU-godtgørelse",null,{"$f":"IF(AND(D11=\"Ja\",F29=\"Ja\"),D29*'Format ark'!D13,0)+IF(AND(D11=\"Ja\",F30=\"Ja\"),D30*'Format ark'!D13,0)+IF(AND(D11=\"Ja\",F31=\"Ja\"),D31*'Format ark'!D13,0)+IF(AND(D11=\"Ja\",F32=\"Ja\"),D32*('Format ark'!D13),0)+IF(AND(D11=\"Ja\",F33=\"Ja\"),D33*'Format ark'!D13,0)+IF(AND(D11=\"Ja\",F34=\"Ja\"),D34*'Format ark'!D13,0)+IF(AND(D11=\"Ja\",F35=\"Ja\"),D35*'Format ark'!D13,0)+IF(AND(D11=\"Ja\",F36=\"Ja\"),D36*'Format ark'!D13,0)+IF(AND(D11=\"Ja\",F37=\"Ja\"),D37*'Format ark'!D13,0)+IF(AND(D11=\"Ja\",F38=\"Ja\"),D38*'Format ark'!D13,0)+IF(AND(D11=\"Ja\",F39=\"Ja\"),D39*'Format ark'!D13,0)+IF(AND(D11=\"Ja\",F40=\"Ja\"),D40*'Format ark'!D13,0)","v":0}]
[null,"Samlet deltagerbetaling (udregner selv)",null,{"$f":"SUM(E29:E40)","v":0}]
[]
[null,"Praktik"]
[null,"Navn på virksomhed og p-nummer"]
[null,"Medarbejderens timeforbrug",null,null,{"$f":"IF(D48>C51*0.5,\"Praktik må maksimalt udgøre 50% af det samlede tidsforbrug.\",\" \")","v":" "}]
[null,"Samlet lønkompensation for praktikopholdet",null,{"$f":"IF(D48>C51*0.5,\"IKKE MULIGT\",D48*(IF(D8>261,260,D8)))","v":0}]
[]
[null,"Samlet tidsforbrug ",{"$f":"IF(D48+D41+D23>300,\"IKKE MULIGT\",D48+D41+D23)","v":0},{"$f":"IF(C51>300,\"Det maksimale tidsforbrug er 300 timer\",\" \")","v":" "}]
[]
[null,"Tidsforbrug til administration","Antal timer","Beløb"]
[null,"Der kan godtgøres op til 5 timer.",null,{"$f":"IF(C54>5,\"Der kan maksimalt godtgøres 5 timer pr. medarbejder.\",C54*260)","v":0}]
[]
[null,"Samlet tilsagnsramme i kr. (maksimal støtte til sporskiftepakken): ",null,{"$f":"IF(C51>300,0,MIN(D49+D44+D42+D26+D24+D54,120000))","v":0},{"$f":"IF(D56=120000,\"Det maksimale tilsagn pr. sporskiftepakke er nået, og det overstigende beløb er derfor selvbetaling.\",\"\")","v":""}]
[]
[]
[null,"Estimeret VEU-godtgørelse",null,{"$f":"D43+D25","v":0}]
[]
[null,"Selvbetaling i kr. (udgifter udover den øvre tilsagnsramme)",null,{"$f":"IF(C51>300,0,IF(D56=120000,D44+D26+D42+D49+D24+D54-120000,0))","v":0}]

{"sheet":"Medarbejder 12","index":12,"n_rows":61,"n_cols":6,"rows_kept":61,"cut":false,"hidden":true,"merged":[[6,1,6,2],[8,1,8,2],[7,1,7,2],[55,1,56,2],[8,4,8,5],[21,1,21,2],[9,1,9,2],[9,4,9,5],[10,1,10,2],[11,1,11,3],[12,1,12,3],[17,1,17,2],[18,1,18,2],[19,1,19,2],[20,1,20,2],[55,3,56,3],[16,1,16,2],[33,1,33,2],[34,1,34,2],[27,1,27,2],[28,1,28,2],[29,1,29,2],[30,1,30,2],[31,1,31,2],[32,1,32,2],[35,1,35,2],[36,1,36,2],[37,1,37,2],[38,1,38,2],[39,1,39,2]]}
[]
[null,null,"Budget/Regnskab for sporskiftepakken"]
[]
[null,null,"Oplysninger om medarbejderen"]
[]
[null,null,"Medarbejder 12"]
[null,"Medarbejderens lønkompensation fra sporskifte (kr./t.)",null,{"$f":"IF(D8>261,(IF(D11=\"Ja\",260-'Format ark'!D13,260)),IF(D8<=260,IF(D11=\"Ja\",IF(D8<'Format ark'!D13,0,D8-'Format ark'!D13),D8)))","v":0}]
[null,"Medarbejderens timesats (kr./t.)"]
[null,"Medarbejderens højst gennemførte uddannelse",null,null,{"$f":"IF(D9=\"\",\"Husk at vælge medarbejderens højst gennemførte uddannelse.\",\" \")","v":"Husk at vælge medarbejderens højst gennemførte uddannelse."}]
[null,"Har medarbejderen brugt sin uddannelse de senest 5 år?",null,null,{"$f":"IF(D10=\"\",\"Husk at svare på spørgsmålet.\",\" \")","v":"Husk at svare på spørgsmålet."}]
[null,"Medarbejder formodes at være berettiget til at få VEU-godtgørelse ",null,{"$f":"IF(OR(D9=\"Videregående uddannelse\",D9=\"Gymnasial uddannelse\")*AND(D10=\"ja\"),\"Nej\",\"Ja\")","v":"Ja"}]
[null,"Beskriv herunder hvad formålet med den planlagte sporskiftepakke er for medarbejderen:"]
[]
[]
[null,null,"Aktiviteter"]
[]
[null,"Afklaring, vejledning mv. \nSkriv navn på kursus",null,"Medarbejderens timeforbug (timer)","Evt. deltagerbetaling (kr.)","Giver kurset ret til VEU-godtgørelse?"]
[]
[]
[]
[]
[]
[null,"Samlet antal timer (udregner selv)",null,{"$f":"SUM(D18:D22)","v":0}]
[null,"Samlet lønkompensation udover evt. VEU-godtgørelse (udregner selv)",null,{"$f":"IF(D11=\"Nej\",D23*D7,0)+IF(AND(D11=\"Ja\",F18=\"Ja\"),D18*D7,0)+IF(AND(D11=\"Ja\",F19=\"Ja\"),D19*D7,0)+IF(AND(D11=\"Ja\",F20=\"Ja\"),D20*D7,0)+IF(AND(D11=\"Ja\",F21=\"Ja\"),D21*D7,0)+IF(AND(D11=\"Ja\",F22=\"Ja\"),D22*D7,0)+IF(AND(D11=\"Ja\",F18=\"Nej\"),D18*IF(D8>261,(IF(F18=\"Ja\",260-'Format ark'!D13,260)),IF(D8<=260,IF(F18=\"Ja\",D8-'Format ark'!D13,D8))),0)+IF(AND(D11=\"Ja\",F19=\"Nej\"),D19*IF(D8>261,(IF(F19=\"Ja\",260-'Format ark'!D13,260)),IF(D8<=260,IF(F19=\"Ja\",D8-'Format ark'!D13,D8))),0)+IF(AND(D11=\"Ja\",F20=\"Nej\"),D20*IF(D8>261,(IF(F20=\"Ja\",260-'Format ark'!D13,260)),IF(D8<=260,IF(F20=\"Ja\",D8-'Format ark'!D13,D8))),0)+IF(AND(D11=\"Ja\",F21=\"Nej\"),D21*IF(D8>261,(IF(F21=\"Ja\",260-'Format ark'!D13,260)),IF(D8<=260,IF(F21=\"Ja\",D8-'Format ark'!D13,D8))),0)+IF(AND(D11=\"Ja\",F22=\"Nej\"),D22*IF(D8>261,(IF(F22=\"Ja\",260-'Format ark'!D13,260)),IF(D8<=260,IF(F22=\"Ja\",D8-'Format ark'!D13,D8))),0)","v":0}]
[null,"Estimeret VEU-godtgørelse",null,{"$f":"IF(AND(D11=\"Ja\",F18=\"Ja\"),D18*'Format ark'!D13,0)+IF(AND(D11=\"Ja\",F19=\"Ja\"),D19*'Format ark'!D13,0)+IF(AND(D11=\"Ja\",F20=\"Ja\"),D20*'Format ark'!D13,0)+IF(AND(D11=\"Ja\",F21=\"Ja\"),D21*'Format ark'!D13,0)+IF(AND(D11=\"Ja\",F22=\"Ja\"),D22*'Format ark'!D13,0)","v":0}]
[null,"Samlet deltagerbeltaing (udregner selv)",null,{"$f":"SUM(E18:E22)","v":0}]
[]
[null,"Erhversrettet efteruddannelse\nSkriv navn på efteruddannelse",null,"Medarbejderens timeforbrug (timer)","Evt. deltagerbetaling (kr.)","Giver kurset ret til VEU-godtgørelse?"]
[]
[]
[]
[]
[]
[]
[]
[]
[]
[]
[]
[null,"Kørsel/transport (angives som faktisk udgift)",null,null,null,"Nej"]
[null,"Samlet antal timer (udregner selv)",null,{"$f":"SUM(D29:D40)","v":0}]
[null,"Samlet lønkompensation udover evt. VEU-godtgørelse (udregner selv)",null,{"$f":"IF(D11=\"Nej\",D41*D7,0)+IF(AND(D11=\"Ja\",F29=\"Ja\"),D29*D7,0)+IF(AND(D11=\"Ja\",F30=\"Ja\"),D30*D7,0)+IF(AND(D11=\"Ja\",F31=\"Ja\"),D31*D7,0)+IF(AND(D11=\"Ja\",F32=\"Ja\"),D32*D7,0)+IF(AND(D11=\"Ja\",F33=\"Ja\"),D33*D7,0)+IF(AND(D11=\"Ja\",F34=\"Ja\"),D34*D7,0)+IF(AND(D11=\"Ja\",F35=\"Ja\"),D35*D7,0)+IF(AND(D11=\"Ja\",F36=\"Ja\"),D36*D7,0)+IF(AND(D11=\"Ja\",F37=\"Ja\"),D37*D7,0)+IF(AND(D11=\"Ja\",F38=\"Ja\"),D38*D7,0)+IF(AND(D11=\"Ja\",F39=\"Ja\"),D39*D7,0)+IF(AND(D11=\"Ja\",F40=\"Ja\"),D40*D7,0)+IF(AND(D11=\"Ja\",F29=\"Nej\"),D29* IF(D8>261,(IF(F29=\"Ja\",260-'Format ark'!D13,260)),IF(D8<=260,IF(F29=\"Ja\",D8-'Format ark'!D13,D8))),0)+IF(AND(D11=\"Ja\",F30=\"Nej\"),D30* IF(D8>261,(IF(F30=\"Ja\",260-'Format ark'!D13,260)),IF(D8<=260,IF(F30=\"Ja\",D8-'Format ark'!D13,D8))),0)+IF(AND(D11=\"Ja\",F31=\"Nej\"),D31* IF(D8>261,(IF(F31=\"Ja\",260-'Format ark'!D13,260)),IF(D8<=260,IF(F31=\"Ja\",D8-'Format ark'!D13,D8))),0)+IF(AND(D11=\"Ja\",F32=\"Nej\"),D32* IF(D8>261,(IF(F32=\"Ja\",260-'Format ark'!D13,260)),IF(D8<=260,IF(F32=\"Ja\",D8-'Format ark'!D13,D8))),0)+IF(AND(D11=\"Ja\",F33=\"Nej\"),D33* IF(D8>261,(IF(F33=\"Ja\",260-'Format ark'!D13,260)),IF(D8<=260,IF(F33=\"Ja\",D8-'Format ark'!D13,D8))),0)+IF(AND(D11=\"Ja\",F34=\"Nej\"),D34* IF(D8>261,(IF(F34=\"Ja\",260-'Format ark'!D13,260)),IF(D8<=260,IF(F34=\"Ja\",D8-'Format ark'!D13,D8))),0)+IF(AND(D11=\"Ja\",F35=\"Nej\"),D35* IF(D8>261,(IF(F35=\"Ja\",260-'Format ark'!D13,260)),IF(D8<=260,IF(F35=\"Ja\",D8-'Format ark'!D13,D8))),0)+IF(AND(D11=\"Ja\",F36=\"Nej\"),D36* IF(D8>261,(IF(F36=\"Ja\",260-'Format ark'!D13,260)),IF(D8<=260,IF(F36=\"Ja\",D8-'Format ark'!D13,D8))),0)+IF(AND(D11=\"Ja\",F37=\"Nej\"),D37* IF(D8>261,(IF(F37=\"Ja\",260-'Format ark'!D13,260)),IF(D8<=260,IF(F37=\"Ja\",D8-'Format ark'!D13,D8))),0)+IF(AND(D11=\"Ja\",F38=\"Nej\"),D38* IF(D8>261,(IF(F38=\"Ja\",260-'Format ark'!D13,260)),IF(D8<=260,IF(F38=\"Ja\",D8-'Format ark'!D13,D8))),0)+IF(AND(D11=\"Ja\",F39=\"Nej\"),D39* IF(D8>261,(IF(F39=\"Ja\",260-'Format ark'!D13,260)),IF(D8<=260,IF(F39=\"Ja\",D8-'Format ark'!D13,D8))),0)+IF(AND(D11=\"Ja\",F40=\"Nej\"),D40* IF(D8>261,(IF(F40=\"Ja\",260-'Format ark'!D13,260)),IF(D8<=260,IF(F40=\"Ja\",D8-'Format ark'!D13,D8))),0)","v":0}]
[null,"Estimeret VEU-godtgørelse",null,{"$f":"IF(AND(D11=\"Ja\",F29=\"Ja\"),D29*'Format ark'!D13,0)+IF(AND(D11=\"Ja\",F30=\"Ja\"),D30*'Format ark'!D13,0)+IF(AND(D11=\"Ja\",F31=\"Ja\"),D31*'Format ark'!D13,0)+IF(AND(D11=\"Ja\",F32=\"Ja\"),D32*('Format ark'!D13),0)+IF(AND(D11=\"Ja\",F33=\"Ja\"),D33*'Format ark'!D13,0)+IF(AND(D11=\"Ja\",F34=\"Ja\"),D34*'Format ark'!D13,0)+IF(AND(D11=\"Ja\",F35=\"Ja\"),D35*'Format ark'!D13,0)+IF(AND(D11=\"Ja\",F36=\"Ja\"),D36*'Format ark'!D13,0)+IF(AND(D11=\"Ja\",F37=\"Ja\"),D37*'Format ark'!D13,0)+IF(AND(D11=\"Ja\",F38=\"Ja\"),D38*'Format ark'!D13,0)+IF(AND(D11=\"Ja\",F39=\"Ja\"),D39*'Format ark'!D13,0)+IF(AND(D11=\"Ja\",F40=\"Ja\"),D40*'Format ark'!D13,0)","v":0}]
[null,"Samlet deltagerbetaling (udregner selv)",null,{"$f":"SUM(E29:E40)","v":0}]
[]
[null,"Praktik"]
[null,"Navn på virksomhed og p-nummer"]
[null,"Medarbejderens timeforbrug",null,null,{"$f":"IF(D48>C51*0.5,\"Praktik må maksimalt udgøre 50% af det samlede tidsforbrug.\",\" \")","v":" "}]
[null,"Samlet lønkompensation for praktikopholdet",null,{"$f":"IF(D48>C51*0.5,\"IKKE MULIGT\",D48*(IF(D8>261,260,D8)))","v":0}]
[]
[null,"Samlet tidsforbrug ",{"$f":"IF(D48+D41+D23>300,\"IKKE MULIGT\",D48+D41+D23)","v":0},{"$f":"IF(C51>300,\"Det maksimale tidsforbrug er 300 timer\",\" \")","v":" "}]
[]
[null,"Tidsforbrug til administration","Antal timer","Beløb"]
[null,"Der kan godtgøres op til 5 timer.",null,{"$f":"IF(C54>5,\"Der kan maksimalt godtgøres 5 timer pr. medarbejder.\",C54*260)","v":0}]
[]
[null,"Samlet tilsagnsramme i kr. (maksimal støtte til sporskiftepakken): ",null,{"$f":"IF(C51>300,0,MIN(D49+D44+D42+D26+D24+D54,120000))","v":0},{"$f":"IF(D56=120000,\"Det maksimale tilsagn pr. sporskiftepakke er nået, og det overstigende beløb er derfor selvbetaling.\",\"\")","v":""}]
[]
[]
[null,"Estimeret VEU-godtgørelse",null,{"$f":"D43+D25","v":0}]
[]
[null,"Selvbetaling i kr. (udgifter udover den øvre tilsagnsramme)",null,{"$f":"IF(C51>300,0,IF(D56=120000,D44+D26+D42+D49+D24+D54-120000,0))","v":0}]

{"sheet":"Medarbejder 13","index":13,"n_rows":61,"n_cols":6,"rows_kept":61,"cut":false,"hidden":true,"merged":[[6,1,6,2],[8,1,8,2],[7,1,7,2],[55,1,56,2],[8,4,8,5],[21,1,21,2],[9,1,9,2],[9,4,9,5],[10,1,10,2],[11,1,11,3],[12,1,12,3],[17,1,17,2],[18,1,18,2],[19,1,19,2],[20,1,20,2],[55,3,56,3],[16,1,16,2],[33,1,33,2],[34,1,34,2],[27,1,27,2],[28,1,28,2],[29,1,29,2],[30,1,30,2],[31,1,31,2],[32,1,32,2],[35,1,35,2],[36,1,36,2],[37,1,37,2],[38,1,38,2],[39,1,39,2]]}
[]
[null,null,"Budget/Regnskab for sporskiftepakken"]
[]
[null,null,"Oplysninger om medarbejderen"]
[]
[null,null,"Medarbejder 13"]
[null,"Medarbejderens lønkompensation fra sporskifte (kr./t.)",null,{"$f":"IF(D8>261,(IF(D11=\"Ja\",260-'Format ark'!D13,260)),IF(D8<=260,IF(D11=\"Ja\",IF(D8<'Format ark'!D13,0,D8-'Format ark'!D13),D8)))","v":0}]
[null,"Medarbejderens timesats (kr./t.)"]
[null,"Medarbejderens højst gennemførte uddannelse",null,null,{"$f":"IF(D9=\"\",\"Husk at vælge medarbejderens højst gennemførte uddannelse.\",\" \")","v":"Husk at vælge medarbejderens højst gennemførte uddannelse."}]
[null,"Har medarbejderen brugt sin uddannelse de senest 5 år?",null,null,{"$f":"IF(D10=\"\",\"Husk at svare på spørgsmålet.\",\" \")","v":"Husk at svare på spørgsmålet."}]
[null,"Medarbejder formodes at være berettiget til at få VEU-godtgørelse ",null,{"$f":"IF(OR(D9=\"Videregående uddannelse\",D9=\"Gymnasial uddannelse\")*AND(D10=\"ja\"),\"Nej\",\"Ja\")","v":"Ja"}]
[null,"Beskriv herunder hvad formålet med den planlagte sporskiftepakke er for medarbejderen:"]
[]
[]
[null,null,"Aktiviteter"]
[]
[null,"Afklaring, vejledning mv. \nSkriv navn på kursus",null,"Medarbejderens timeforbug (timer)","Evt. deltagerbetaling (kr.)","Giver kurset ret til VEU-godtgørelse?"]
[]
[]
[]
[]
[]
[null,"Samlet antal timer (udregner selv)",null,{"$f":"SUM(D18:D22)","v":0}]
[null,"Samlet lønkompensation udover evt. VEU-godtgørelse (udregner selv)",null,{"$f":"IF(D11=\"Nej\",D23*D7,0)+IF(AND(D11=\"Ja\",F18=\"Ja\"),D18*D7,0)+IF(AND(D11=\"Ja\",F19=\"Ja\"),D19*D7,0)+IF(AND(D11=\"Ja\",F20=\"Ja\"),D20*D7,0)+IF(AND(D11=\"Ja\",F21=\"Ja\"),D21*D7,0)+IF(AND(D11=\"Ja\",F22=\"Ja\"),D22*D7,0)+IF(AND(D11=\"Ja\",F18=\"Nej\"),D18*IF(D8>261,(IF(F18=\"Ja\",260-'Format ark'!D13,260)),IF(D8<=260,IF(F18=\"Ja\",D8-'Format ark'!D13,D8))),0)+IF(AND(D11=\"Ja\",F19=\"Nej\"),D19*IF(D8>261,(IF(F19=\"Ja\",260-'Format ark'!D13,260)),IF(D8<=260,IF(F19=\"Ja\",D8-'Format ark'!D13,D8))),0)+IF(AND(D11=\"Ja\",F20=\"Nej\"),D20*IF(D8>261,(IF(F20=\"Ja\",260-'Format ark'!D13,260)),IF(D8<=260,IF(F20=\"Ja\",D8-'Format ark'!D13,D8))),0)+IF(AND(D11=\"Ja\",F21=\"Nej\"),D21*IF(D8>261,(IF(F21=\"Ja\",260-'Format ark'!D13,260)),IF(D8<=260,IF(F21=\"Ja\",D8-'Format ark'!D13,D8))),0)+IF(AND(D11=\"Ja\",F22=\"Nej\"),D22*IF(D8>261,(IF(F22=\"Ja\",260-'Format ark'!D13,260)),IF(D8<=260,IF(F22=\"Ja\",D8-'Format ark'!D13,D8))),0)","v":0}]
[null,"Estimeret VEU-godtgørelse",null,{"$f":"IF(AND(D11=\"Ja\",F18=\"Ja\"),D18*'Format ark'!D13,0)+IF(AND(D11=\"Ja\",F19=\"Ja\"),D19*'Format ark'!D13,0)+IF(AND(D11=\"Ja\",F20=\"Ja\"),D20*'Format ark'!D13,0)+IF(AND(D11=\"Ja\",F21=\"Ja\"),D21*'Format ark'!D13,0)+IF(AND(D11=\"Ja\",F22=\"Ja\"),D22*'Format ark'!D13,0)","v":0}]
[null,"Samlet deltagerbeltaing (udregner selv)",null,{"$f":"SUM(E18:E22)","v":0}]
[]
[null,"Erhversrettet efteruddannelse\nSkriv navn på efteruddannelse",null,"Medarbejderens timeforbrug (timer)","Evt. deltagerbetaling (kr.)","Giver kurset ret til VEU-godtgørelse?"]
[]
[]
[]
[]
[]
[]
[]
[]
[]
[]
[]
[null,"Kørsel/transport (angives som faktisk udgift)",null,null,null,"Nej"]
[null,"Samlet antal timer (udregner selv)",null,{"$f":"SUM(D29:D40)","v":0}]
[null,"Samlet lønkompensation udover evt. VEU-godtgørelse (udregner selv)",null,{"$f":"IF(D11=\"Nej\",D41*D7,0)+IF(AND(D11=\"Ja\",F29=\"Ja\"),D29*D7,0)+IF(AND(D11=\"Ja\",F30=\"Ja\"),D30*D7,0)+IF(AND(D11=\"Ja\",F31=\"Ja\"),D31*D7,0)+IF(AND(D11=\"Ja\",F32=\"Ja\"),D32*D7,0)+IF(AND(D11=\"Ja\",F33=\"Ja\"),D33*D7,0)+IF(AND(D11=\"Ja\",F34=\"Ja\"),D34*D7,0)+IF(AND(D11=\"Ja\",F35=\"Ja\"),D35*D7,0)+IF(AND(D11=\"Ja\",F36=\"Ja\"),D36*D7,0)+IF(AND(D11=\"Ja\",F37=\"Ja\"),D37*D7,0)+IF(AND(D11=\"Ja\",F38=\"Ja\"),D38*D7,0)+IF(AND(D11=\"Ja\",F39=\"Ja\"),D39*D7,0)+IF(AND(D11=\"Ja\",F40=\"Ja\"),D40*D7,0)+IF(AND(D11=\"Ja\",F29=\"Nej\"),D29* IF(D8>261,(IF(F29=\"Ja\",260-'Format ark'!D13,260)),IF(D8<=260,IF(F29=\"Ja\",D8-'Format ark'!D13,D8))),0)+IF(AND(D11=\"Ja\",F30=\"Nej\"),D30* IF(D8>261,(IF(F30=\"Ja\",260-'Format ark'!D13,260)),IF(D8<=260,IF(F30=\"Ja\",D8-'Format ark'!D13,D8))),0)+IF(AND(D11=\"Ja\",F31=\"Nej\"),D31* IF(D8>261,(IF(F31=\"Ja\",260-'Format ark'!D13,260)),IF(D8<=260,IF(F31=\"Ja\",D8-'Format ark'!D13,D8))),0)+IF(AND(D11=\"Ja\",F32=\"Nej\"),D32* IF(D8>261,(IF(F32=\"Ja\",260-'Format ark'!D13,260)),IF(D8<=260,IF(F32=\"Ja\",D8-'Format ark'!D13,D8))),0)+IF(AND(D11=\"Ja\",F33=\"Nej\"),D33* IF(D8>261,(IF(F33=\"Ja\",260-'Format ark'!D13,260)),IF(D8<=260,IF(F33=\"Ja\",D8-'Format ark'!D13,D8))),0)+IF(AND(D11=\"Ja\",F34=\"Nej\"),D34* IF(D8>261,(IF(F34=\"Ja\",260-'Format ark'!D13,260)),IF(D8<=260,IF(F34=\"Ja\",D8-'Format ark'!D13,D8))),0)+IF(AND(D11=\"Ja\",F35=\"Nej\"),D35* IF(D8>261,(IF(F35=\"Ja\",260-'Format ark'!D13,260)),IF(D8<=260,IF(F35=\"Ja\",D8-'Format ark'!D13,D8))),0)+IF(AND(D11=\"Ja\",F36=\"Nej\"),D36* IF(D8>261,(IF(F36=\"Ja\",260-'Format ark'!D13,260)),IF(D8<=260,IF(F36=\"Ja\",D8-'Format ark'!D13,D8))),0)+IF(AND(D11=\"Ja\",F37=\"Nej\"),D37* IF(D8>261,(IF(F37=\"Ja\",260-'Format ark'!D13,260)),IF(D8<=260,IF(F37=\"Ja\",D8-'Format ark'!D13,D8))),0)+IF(AND(D11=\"Ja\",F38=\"Nej\"),D38* IF(D8>261,(IF(F38=\"Ja\",260-'Format ark'!D13,260)),IF(D8<=260,IF(F38=\"Ja\",D8-'Format ark'!D13,D8))),0)+IF(AND(D11=\"Ja\",F39=\"Nej\"),D39* IF(D8>261,(IF(F39=\"Ja\",260-'Format ark'!D13,260)),IF(D8<=260,IF(F39=\"Ja\",D8-'Format ark'!D13,D8))),0)+IF(AND(D11=\"Ja\",F40=\"Nej\"),D40* IF(D8>261,(IF(F40=\"Ja\",260-'Format ark'!D13,260)),IF(D8<=260,IF(F40=\"Ja\",D8-'Format ark'!D13,D8))),0)","v":0}]
[null,"Estimeret VEU-godtgørelse",null,{"$f":"IF(AND(D11=\"Ja\",F29=\"Ja\"),D29*'Format ark'!D13,0)+IF(AND(D11=\"Ja\",F30=\"Ja\"),D30*'Format ark'!D13,0)+IF(AND(D11=\"Ja\",F31=\"Ja\"),D31*'Format ark'!D13,0)+IF(AND(D11=\"Ja\",F32=\"Ja\"),D32*('Format ark'!D13),0)+IF(AND(D11=\"Ja\",F33=\"Ja\"),D33*'Format ark'!D13,0)+IF(AND(D11=\"Ja\",F34=\"Ja\"),D34*'Format ark'!D13,0)+IF(AND(D11=\"Ja\",F35=\"Ja\"),D35*'Format ark'!D13,0)+IF(AND(D11=\"Ja\",F36=\"Ja\"),D36*'Format ark'!D13,0)+IF(AND(D11=\"Ja\",F37=\"Ja\"),D37*'Format ark'!D13,0)+IF(AND(D11=\"Ja\",F38=\"Ja\"),D38*'Format ark'!D13,0)+IF(AND(D11=\"Ja\",F39=\"Ja\"),D39*'Format ark'!D13,0)+IF(AND(D11=\"Ja\",F40=\"Ja\"),D40*'Format ark'!D13,0)","v":0}]
[null,"Samlet deltagerbetaling (udregner selv)",null,{"$f":"SUM(E29:E40)","v":0}]
[]
[null,"Praktik"]
[null,"Navn på virksomhed og p-nummer"]
[null,"Medarbejderens timeforbrug",null,null,{"$f":"IF(D48>C51*0.5,\"Praktik må maksimalt udgøre 50% af det samlede tidsforbrug.\",\" \")","v":" "}]
[null,"Samlet lønkompensation for praktikopholdet",null,{"$f":"IF(D48>C51*0.5,\"IKKE MULIGT\",D48*(IF(D8>261,260,D8)))","v":0}]
[]
[null,"Samlet tidsforbrug ",{"$f":"IF(D48+D41+D23>300,\"IKKE MULIGT\",D48+D41+D23)","v":0},{"$f":"IF(C51>300,\"Det maksimale tidsforbrug er 300 timer\",\" \")","v":" "}]
[]
[null,"Tidsforbrug til administration","Antal timer","Beløb"]
[null,"Der kan godtgøres op til 5 timer.",null,{"$f":"IF(C54>5,\"Der kan maksimalt godtgøres 5 timer pr. medarbejder.\",C54*260)","v":0}]
[]
[null,"Samlet tilsagnsramme i kr. (maksimal støtte til sporskiftepakken): ",null,{"$f":"IF(C51>300,0,MIN(D49+D44+D42+D26+D24+D54,120000))","v":0},{"$f":"IF(D56=120000,\"Det maksimale tilsagn pr. sporskiftepakke er nået, og det overstigende beløb er derfor selvbetaling.\",\"\")","v":""}]
[]
[]
[null,"Estimeret VEU-godtgørelse",null,{"$f":"D43+D25","v":0}]
[]
[null,"Selvbetaling i kr. (udgifter udover den øvre tilsagnsramme)",null,{"$f":"IF(C51>300,0,IF(D56=120000,D44+D26+D42+D49+D24+D54-120000,0))","v":0}]

{"sheet":"Medarbejder 14","index":14,"n_rows":61,"n_cols":6,"rows_kept":61,"cut":false,"hidden":true,"merged":[[6,1,6,2],[8,1,8,2],[7,1,7,2],[55,1,56,2],[8,4,8,5],[21,1,21,2],[9,1,9,2],[9,4,9,5],[10,1,10,2],[11,1,11,3],[12,1,12,3],[17,1,17,2],[18,1,18,2],[19,1,19,2],[20,1,20,2],[55,3,56,3],[16,1,16,2],[33,1,33,2],[34,1,34,2],[27,1,27,2],[28,1,28,2],[29,1,29,2],[30,1,30,2],[31,1,31,2],[32,1,32,2],[35,1,35,2],[36,1,36,2],[37,1,37,2],[38,1,38,2],[39,1,39,2]]}
[]
[null,null,"Budget/Regnskab for sporskiftepakken"]
[]
[null,null,"Oplysninger om medarbejderen"]
[]
[null,null,"Medarbejder 14"]
[null,"Medarbejderens lønkompensation fra sporskifte (kr./t.)",null,{"$f":"IF(D8>261,(IF(D11=\"Ja\",260-'Format ark'!D13,260)),IF(D8<=260,IF(D11=\"Ja\",IF(D8<'Format ark'!D13,0,D8-'Format ark'!D13),D8)))","v":0}]
[null,"Medarbejderens timesats (kr./t.)"]
[null,"Medarbejderens højst gennemførte uddannelse",null,null,{"$f":"IF(D9=\"\",\"Husk at vælge medarbejderens højst gennemførte uddannelse.\",\" \")","v":"Husk at vælge medarbejderens højst gennemførte uddannelse."}]
[null,"Har medarbejderen brugt sin uddannelse de senest 5 år?",null,null,{"$f":"IF(D10=\"\",\"Husk at svare på spørgsmålet.\",\" \")","v":"Husk at svare på spørgsmålet."}]
[null,"Medarbejder formodes at være berettiget til at få VEU-godtgørelse ",null,{"$f":"IF(OR(D9=\"Videregående uddannelse\",D9=\"Gymnasial uddannelse\")*AND(D10=\"ja\"),\"Nej\",\"Ja\")","v":"Ja"}]
[null,"Beskriv herunder hvad formålet med den planlagte sporskiftepakke er for medarbejderen:"]
[]
[]
[null,null,"Aktiviteter"]
[]
[null,"Afklaring, vejledning mv. \nSkriv navn på kursus",null,"Medarbejderens timeforbug (timer)","Evt. deltagerbetaling (kr.)","Giver kurset ret til VEU-godtgørelse?"]
[]
[]
[]
[]
[]
[null,"Samlet antal timer (udregner selv)",null,{"$f":"SUM(D18:D22)","v":0}]
[null,"Samlet lønkompensation udover evt. VEU-godtgørelse (udregner selv)",null,{"$f":"IF(D11=\"Nej\",D23*D7,0)+IF(AND(D11=\"Ja\",F18=\"Ja\"),D18*D7,0)+IF(AND(D11=\"Ja\",F19=\"Ja\"),D19*D7,0)+IF(AND(D11=\"Ja\",F20=\"Ja\"),D20*D7,0)+IF(AND(D11=\"Ja\",F21=\"Ja\"),D21*D7,0)+IF(AND(D11=\"Ja\",F22=\"Ja\"),D22*D7,0)+IF(AND(D11=\"Ja\",F18=\"Nej\"),D18*IF(D8>261,(IF(F18=\"Ja\",260-'Format ark'!D13,260)),IF(D8<=260,IF(F18=\"Ja\",D8-'Format ark'!D13,D8))),0)+IF(AND(D11=\"Ja\",F19=\"Nej\"),D19*IF(D8>261,(IF(F19=\"Ja\",260-'Format ark'!D13,260)),IF(D8<=260,IF(F19=\"Ja\",D8-'Format ark'!D13,D8))),0)+IF(AND(D11=\"Ja\",F20=\"Nej\"),D20*IF(D8>261,(IF(F20=\"Ja\",260-'Format ark'!D13,260)),IF(D8<=260,IF(F20=\"Ja\",D8-'Format ark'!D13,D8))),0)+IF(AND(D11=\"Ja\",F21=\"Nej\"),D21*IF(D8>261,(IF(F21=\"Ja\",260-'Format ark'!D13,260)),IF(D8<=260,IF(F21=\"Ja\",D8-'Format ark'!D13,D8))),0)+IF(AND(D11=\"Ja\",F22=\"Nej\"),D22*IF(D8>261,(IF(F22=\"Ja\",260-'Format ark'!D13,260)),IF(D8<=260,IF(F22=\"Ja\",D8-'Format ark'!D13,D8))),0)","v":0}]
[null,"Estimeret VEU-godtgørelse",null,{"$f":"IF(AND(D11=\"Ja\",F18=\"Ja\"),D18*'Format ark'!D13,0)+IF(AND(D11=\"Ja\",F19=\"Ja\"),D19*'Format ark'!D13,0)+IF(AND(D11=\"Ja\",F20=\"Ja\"),D20*'Format ark'!D13,0)+IF(AND(D11=\"Ja\",F21=\"Ja\"),D21*'Format ark'!D13,0)+IF(AND(D11=\"Ja\",F22=\"Ja\"),D22*'Format ark'!D13,0)","v":0}]
[null,"Samlet deltagerbeltaing (udregner selv)",null,{"$f":"SUM(E18:E22)","v":0}]
[]
[null,"Erhversrettet efteruddannelse\nSkriv navn på efteruddannelse",null,"Medarbejderens timeforbrug (timer)","Evt. deltagerbetaling (kr.)","Giver kurset ret til VEU-godtgørelse?"]
[]
[]
[]
[]
[]
[]
[]
[]
[]
[]
[]
[null,"Kørsel/transport (angives som faktisk udgift)",null,null,null,"Nej"]
[null,"Samlet antal timer (udregner selv)",null,{"$f":"SUM(D29:D40)","v":0}]
[null,"Samlet lønkompensation udover evt. VEU-godtgørelse (udregner selv)",null,{"$f":"IF(D11=\"Nej\",D41*D7,0)+IF(AND(D11=\"Ja\",F29=\"Ja\"),D29*D7,0)+IF(AND(D11=\"Ja\",F30=\"Ja\"),D30*D7,0)+IF(AND(D11=\"Ja\",F31=\"Ja\"),D31*D7,0)+IF(AND(D11=\"Ja\",F32=\"Ja\"),D32*D7,0)+IF(AND(D11=\"Ja\",F33=\"Ja\"),D33*D7,0)+IF(AND(D11=\"Ja\",F34=\"Ja\"),D34*D7,0)+IF(AND(D11=\"Ja\",F35=\"Ja\"),D35*D7,0)+IF(AND(D11=\"Ja\",F36=\"Ja\"),D36*D7,0)+IF(AND(D11=\"Ja\",F37=\"Ja\"),D37*D7,0)+IF(AND(D11=\"Ja\",F38=\"Ja\"),D38*D7,0)+IF(AND(D11=\"Ja\",F39=\"Ja\"),D39*D7,0)+IF(AND(D11=\"Ja\",F40=\"Ja\"),D40*D7,0)+IF(AND(D11=\"Ja\",F29=\"Nej\"),D29* IF(D8>261,(IF(F29=\"Ja\",260-'Format ark'!D13,260)),IF(D8<=260,IF(F29=\"Ja\",D8-'Format ark'!D13,D8))),0)+IF(AND(D11=\"Ja\",F30=\"Nej\"),D30* IF(D8>261,(IF(F30=\"Ja\",260-'Format ark'!D13,260)),IF(D8<=260,IF(F30=\"Ja\",D8-'Format ark'!D13,D8))),0)+IF(AND(D11=\"Ja\",F31=\"Nej\"),D31* IF(D8>261,(IF(F31=\"Ja\",260-'Format ark'!D13,260)),IF(D8<=260,IF(F31=\"Ja\",D8-'Format ark'!D13,D8))),0)+IF(AND(D11=\"Ja\",F32=\"Nej\"),D32* IF(D8>261,(IF(F32=\"Ja\",260-'Format ark'!D13,260)),IF(D8<=260,IF(F32=\"Ja\",D8-'Format ark'!D13,D8))),0)+IF(AND(D11=\"Ja\",F33=\"Nej\"),D33* IF(D8>261,(IF(F33=\"Ja\",260-'Format ark'!D13,260)),IF(D8<=260,IF(F33=\"Ja\",D8-'Format ark'!D13,D8))),0)+IF(AND(D11=\"Ja\",F34=\"Nej\"),D34* IF(D8>261,(IF(F34=\"Ja\",260-'Format ark'!D13,260)),IF(D8<=260,IF(F34=\"Ja\",D8-'Format ark'!D13,D8))),0)+IF(AND(D11=\"Ja\",F35=\"Nej\"),D35* IF(D8>261,(IF(F35=\"Ja\",260-'Format ark'!D13,260)),IF(D8<=260,IF(F35=\"Ja\",D8-'Format ark'!D13,D8))),0)+IF(AND(D11=\"Ja\",F36=\"Nej\"),D36* IF(D8>261,(IF(F36=\"Ja\",260-'Format ark'!D13,260)),IF(D8<=260,IF(F36=\"Ja\",D8-'Format ark'!D13,D8))),0)+IF(AND(D11=\"Ja\",F37=\"Nej\"),D37* IF(D8>261,(IF(F37=\"Ja\",260-'Format ark'!D13,260)),IF(D8<=260,IF(F37=\"Ja\",D8-'Format ark'!D13,D8))),0)+IF(AND(D11=\"Ja\",F38=\"Nej\"),D38* IF(D8>261,(IF(F38=\"Ja\",260-'Format ark'!D13,260)),IF(D8<=260,IF(F38=\"Ja\",D8-'Format ark'!D13,D8))),0)+IF(AND(D11=\"Ja\",F39=\"Nej\"),D39* IF(D8>261,(IF(F39=\"Ja\",260-'Format ark'!D13,260)),IF(D8<=260,IF(F39=\"Ja\",D8-'Format ark'!D13,D8))),0)+IF(AND(D11=\"Ja\",F40=\"Nej\"),D40* IF(D8>261,(IF(F40=\"Ja\",260-'Format ark'!D13,260)),IF(D8<=260,IF(F40=\"Ja\",D8-'Format ark'!D13,D8))),0)","v":0}]
[null,"Estimeret VEU-godtgørelse",null,{"$f":"IF(AND(D11=\"Ja\",F29=\"Ja\"),D29*'Format ark'!D13,0)+IF(AND(D11=\"Ja\",F30=\"Ja\"),D30*'Format ark'!D13,0)+IF(AND(D11=\"Ja\",F31=\"Ja\"),D31*'Format ark'!D13,0)+IF(AND(D11=\"Ja\",F32=\"Ja\"),D32*('Format ark'!D13),0)+IF(AND(D11=\"Ja\",F33=\"Ja\"),D33*'Format ark'!D13,0)+IF(AND(D11=\"Ja\",F34=\"Ja\"),D34*'Format ark'!D13,0)+IF(AND(D11=\"Ja\",F35=\"Ja\"),D35*'Format ark'!D13,0)+IF(AND(D11=\"Ja\",F36=\"Ja\"),D36*'Format ark'!D13,0)+IF(AND(D11=\"Ja\",F37=\"Ja\"),D37*'Format ark'!D13,0)+IF(AND(D11=\"Ja\",F38=\"Ja\"),D38*'Format ark'!D13,0)+IF(AND(D11=\"Ja\",F39=\"Ja\"),D39*'Format ark'!D13,0)+IF(AND(D11=\"Ja\",F40=\"Ja\"),D40*'Format ark'!D13,0)","v":0}]
[null,"Samlet deltagerbetaling (udregner selv)",null,{"$f":"SUM(E29:E40)","v":0}]
[]
[null,"Praktik"]
[null,"Navn på virksomhed og p-nummer"]
[null,"Medarbejderens timeforbrug",null,null,{"$f":"IF(D48>C51*0.5,\"Praktik må maksimalt udgøre 50% af det samlede tidsforbrug.\",\" \")","v":" "}]
[null,"Samlet lønkompensation for praktikopholdet",null,{"$f":"IF(D48>C51*0.5,\"IKKE MULIGT\",D48*(IF(D8>261,260,D8)))","v":0}]
[]
[null,"Samlet tidsforbrug ",{"$f":"IF(D48+D41+D23>300,\"IKKE MULIGT\",D48+D41+D23)","v":0},{"$f":"IF(C51>300,\"Det maksimale tidsforbrug er 300 timer\",\" \")","v":" "}]
[]
[null,"Tidsforbrug til administration","Antal timer","Beløb"]
[null,"Der kan godtgøres op til 5 timer.",null,{"$f":"IF(C54>5,\"Der kan maksimalt godtgøres 5 timer pr. medarbejder.\",C54*260)","v":0}]
[]
[null,"Samlet tilsagnsramme i kr. (maksimal støtte til sporskiftepakken): ",null,{"$f":"IF(C51>300,0,MIN(D49+D44+D42+D26+D24+D54,120000))","v":0},{"$f":"IF(D56=120000,\"Det maksimale tilsagn pr. sporskiftepakke er nået, og det overstigende beløb er derfor selvbetaling.\",\"\")","v":""}]
[]
[]
[null,"Estimeret VEU-godtgørelse",null,{"$f":"D43+D25","v":0}]
[]
[null,"Selvbetaling i kr. (udgifter udover den øvre tilsagnsramme)",null,{"$f":"IF(C51>300,0,IF(D56=120000,D44+D26+D42+D49+D24+D54-120000,0))","v":0}]

{"sheet":"Medarbejder 15","index":15,"n_rows":61,"n_cols":6,"rows_kept":61,"cut":false,"hidden":true,"merged":[[6,1,6,2],[8,1,8,2],[7,1,7,2],[55,1,56,2],[8,4,8,5],[21,1,21,2],[9,1,9,2],[9,4,9,5],[10,1,10,2],[11,1,11,3],[12,1,12,3],[17,1,17,2],[18,1,18,2],[19,1,19,2],[20,1,20,2],[55,3,56,3],[16,1,16,2],[33,1,33,2],[34,1,34,2],[27,1,27,2],[28,1,28,2],[29,1,29,2],[30,1,30,2],[31,1,31,2],[32,1,32,2],[35,1,35,2],[36,1,36,2],[37,1,37,2],[38,1,38,2],[39,1,39,2]]}
[]
[null,null,"Budget/Regnskab for sporskiftepakken"]
[]
[null,null,"Oplysninger om medarbejderen"]
[]
[null,null,"Medarbejder 15"]
[null,"Medarbejderens lønkompensation fra sporskifte (kr./t.)",null,{"$f":"IF(D8>261,(IF(D11=\"Ja\",260-'Format ark'!D13,260)),IF(D8<=260,IF(D11=\"Ja\",IF(D8<'Format ark'!D13,0,D8-'Format ark'!D13),D8)))","v":0}]
[null,"Medarbejderens timesats (kr./t.)"]
[null,"Medarbejderens højst gennemførte uddannelse",null,null,{"$f":"IF(D9=\"\",\"Husk at vælge medarbejderens højst gennemførte uddannelse.\",\" \")","v":"Husk at vælge medarbejderens højst gennemførte uddannelse."}]
[null,"Har medarbejderen brugt sin uddannelse de senest 5 år?",null,null,{"$f":"IF(D10=\"\",\"Husk at svare på spørgsmålet.\",\" \")","v":"Husk at svare på spørgsmålet."}]
[null,"Medarbejder formodes at være berettiget til at få VEU-godtgørelse ",null,{"$f":"IF(OR(D9=\"Videregående uddannelse\",D9=\"Gymnasial uddannelse\")*AND(D10=\"ja\"),\"Nej\",\"Ja\")","v":"Ja"}]
[null,"Beskriv herunder hvad formålet med den planlagte sporskiftepakke er for medarbejderen:"]
[]
[]
[null,null,"Aktiviteter"]
[]
[null,"Afklaring, vejledning mv. \nSkriv navn på kursus",null,"Medarbejderens timeforbug (timer)","Evt. deltagerbetaling (kr.)","Giver kurset ret til VEU-godtgørelse?"]
[]
[]
[]
[]
[]
[null,"Samlet antal timer (udregner selv)",null,{"$f":"SUM(D18:D22)","v":0}]
[null,"Samlet lønkompensation udover evt. VEU-godtgørelse (udregner selv)",null,{"$f":"IF(D11=\"Nej\",D23*D7,0)+IF(AND(D11=\"Ja\",F18=\"Ja\"),D18*D7,0)+IF(AND(D11=\"Ja\",F19=\"Ja\"),D19*D7,0)+IF(AND(D11=\"Ja\",F20=\"Ja\"),D20*D7,0)+IF(AND(D11=\"Ja\",F21=\"Ja\"),D21*D7,0)+IF(AND(D11=\"Ja\",F22=\"Ja\"),D22*D7,0)+IF(AND(D11=\"Ja\",F18=\"Nej\"),D18*IF(D8>261,(IF(F18=\"Ja\",260-'Format ark'!D13,260)),IF(D8<=260,IF(F18=\"Ja\",D8-'Format ark'!D13,D8))),0)+IF(AND(D11=\"Ja\",F19=\"Nej\"),D19*IF(D8>261,(IF(F19=\"Ja\",260-'Format ark'!D13,260)),IF(D8<=260,IF(F19=\"Ja\",D8-'Format ark'!D13,D8))),0)+IF(AND(D11=\"Ja\",F20=\"Nej\"),D20*IF(D8>261,(IF(F20=\"Ja\",260-'Format ark'!D13,260)),IF(D8<=260,IF(F20=\"Ja\",D8-'Format ark'!D13,D8))),0)+IF(AND(D11=\"Ja\",F21=\"Nej\"),D21*IF(D8>261,(IF(F21=\"Ja\",260-'Format ark'!D13,260)),IF(D8<=260,IF(F21=\"Ja\",D8-'Format ark'!D13,D8))),0)+IF(AND(D11=\"Ja\",F22=\"Nej\"),D22*IF(D8>261,(IF(F22=\"Ja\",260-'Format ark'!D13,260)),IF(D8<=260,IF(F22=\"Ja\",D8-'Format ark'!D13,D8))),0)","v":0}]
[null,"Estimeret VEU-godtgørelse",null,{"$f":"IF(AND(D11=\"Ja\",F18=\"Ja\"),D18*'Format ark'!D13,0)+IF(AND(D11=\"Ja\",F19=\"Ja\"),D19*'Format ark'!D13,0)+IF(AND(D11=\"Ja\",F20=\"Ja\"),D20*'Format ark'!D13,0)+IF(AND(D11=\"Ja\",F21=\"Ja\"),D21*'Format ark'!D13,0)+IF(AND(D11=\"Ja\",F22=\"Ja\"),D22*'Format ark'!D13,0)","v":0}]
[null,"Samlet deltagerbeltaing (udregner selv)",null,{"$f":"SUM(E18:E22)","v":0}]
[]
[null,"Erhversrettet efteruddannelse\nSkriv navn på efteruddannelse",null,"Medarbejderens timeforbrug (timer)","Evt. deltagerbetaling (kr.)","Giver kurset ret til VEU-godtgørelse?"]
[]
[]
[]
[]
[]
[]
[]
[]
[]
[]
[]
[null,"Kørsel/transport (angives som faktisk udgift)",null,null,null,"Nej"]
[null,"Samlet antal timer (udregner selv)",null,{"$f":"SUM(D29:D40)","v":0}]
[null,"Samlet lønkompensation udover evt. VEU-godtgørelse (udregner selv)",null,{"$f":"IF(D11=\"Nej\",D41*D7,0)+IF(AND(D11=\"Ja\",F29=\"Ja\"),D29*D7,0)+IF(AND(D11=\"Ja\",F30=\"Ja\"),D30*D7,0)+IF(AND(D11=\"Ja\",F31=\"Ja\"),D31*D7,0)+IF(AND(D11=\"Ja\",F32=\"Ja\"),D32*D7,0)+IF(AND(D11=\"Ja\",F33=\"Ja\"),D33*D7,0)+IF(AND(D11=\"Ja\",F34=\"Ja\"),D34*D7,0)+IF(AND(D11=\"Ja\",F35=\"Ja\"),D35*D7,0)+IF(AND(D11=\"Ja\",F36=\"Ja\"),D36*D7,0)+IF(AND(D11=\"Ja\",F37=\"Ja\"),D37*D7,0)+IF(AND(D11=\"Ja\",F38=\"Ja\"),D38*D7,0)+IF(AND(D11=\"Ja\",F39=\"Ja\"),D39*D7,0)+IF(AND(D11=\"Ja\",F40=\"Ja\"),D40*D7,0)+IF(AND(D11=\"Ja\",F29=\"Nej\"),D29* IF(D8>261,(IF(F29=\"Ja\",260-'Format ark'!D13,260)),IF(D8<=260,IF(F29=\"Ja\",D8-'Format ark'!D13,D8))),0)+IF(AND(D11=\"Ja\",F30=\"Nej\"),D30* IF(D8>261,(IF(F30=\"Ja\",260-'Format ark'!D13,260)),IF(D8<=260,IF(F30=\"Ja\",D8-'Format ark'!D13,D8))),0)+IF(AND(D11=\"Ja\",F31=\"Nej\"),D31* IF(D8>261,(IF(F31=\"Ja\",260-'Format ark'!D13,260)),IF(D8<=260,IF(F31=\"Ja\",D8-'Format ark'!D13,D8))),0)+IF(AND(D11=\"Ja\",F32=\"Nej\"),D32* IF(D8>261,(IF(F32=\"Ja\",260-'Format ark'!D13,260)),IF(D8<=260,IF(F32=\"Ja\",D8-'Format ark'!D13,D8))),0)+IF(AND(D11=\"Ja\",F33=\"Nej\"),D33* IF(D8>261,(IF(F33=\"Ja\",260-'Format ark'!D13,260)),IF(D8<=260,IF(F33=\"Ja\",D8-'Format ark'!D13,D8))),0)+IF(AND(D11=\"Ja\",F34=\"Nej\"),D34* IF(D8>261,(IF(F34=\"Ja\",260-'Format ark'!D13,260)),IF(D8<=260,IF(F34=\"Ja\",D8-'Format ark'!D13,D8))),0)+IF(AND(D11=\"Ja\",F35=\"Nej\"),D35* IF(D8>261,(IF(F35=\"Ja\",260-'Format ark'!D13,260)),IF(D8<=260,IF(F35=\"Ja\",D8-'Format ark'!D13,D8))),0)+IF(AND(D11=\"Ja\",F36=\"Nej\"),D36* IF(D8>261,(IF(F36=\"Ja\",260-'Format ark'!D13,260)),IF(D8<=260,IF(F36=\"Ja\",D8-'Format ark'!D13,D8))),0)+IF(AND(D11=\"Ja\",F37=\"Nej\"),D37* IF(D8>261,(IF(F37=\"Ja\",260-'Format ark'!D13,260)),IF(D8<=260,IF(F37=\"Ja\",D8-'Format ark'!D13,D8))),0)+IF(AND(D11=\"Ja\",F38=\"Nej\"),D38* IF(D8>261,(IF(F38=\"Ja\",260-'Format ark'!D13,260)),IF(D8<=260,IF(F38=\"Ja\",D8-'Format ark'!D13,D8))),0)+IF(AND(D11=\"Ja\",F39=\"Nej\"),D39* IF(D8>261,(IF(F39=\"Ja\",260-'Format ark'!D13,260)),IF(D8<=260,IF(F39=\"Ja\",D8-'Format ark'!D13,D8))),0)+IF(AND(D11=\"Ja\",F40=\"Nej\"),D40* IF(D8>261,(IF(F40=\"Ja\",260-'Format ark'!D13,260)),IF(D8<=260,IF(F40=\"Ja\",D8-'Format ark'!D13,D8))),0)","v":0}]
[null,"Estimeret VEU-godtgørelse",null,{"$f":"IF(AND(D11=\"Ja\",F29=\"Ja\"),D29*'Format ark'!D13,0)+IF(AND(D11=\"Ja\",F30=\"Ja\"),D30*'Format ark'!D13,0)+IF(AND(D11=\"Ja\",F31=\"Ja\"),D31*'Format ark'!D13,0)+IF(AND(D11=\"Ja\",F32=\"Ja\"),D32*('Format ark'!D13),0)+IF(AND(D11=\"Ja\",F33=\"Ja\"),D33*'Format ark'!D13,0)+IF(AND(D11=\"Ja\",F34=\"Ja\"),D34*'Format ark'!D13,0)+IF(AND(D11=\"Ja\",F35=\"Ja\"),D35*'Format ark'!D13,0)+IF(AND(D11=\"Ja\",F36=\"Ja\"),D36*'Format ark'!D13,0)+IF(AND(D11=\"Ja\",F37=\"Ja\"),D37*'Format ark'!D13,0)+IF(AND(D11=\"Ja\",F38=\"Ja\"),D38*'Format ark'!D13,0)+IF(AND(D11=\"Ja\",F39=\"Ja\"),D39*'Format ark'!D13,0)+IF(AND(D11=\"Ja\",F40=\"Ja\"),D40*'Format ark'!D13,0)","v":0}]
[null,"Samlet deltagerbetaling (udregner selv)",null,{"$f":"SUM(E29:E40)","v":0}]
[]
[null,"Praktik"]
[null,"Navn på virksomhed og p-nummer"]
[null,"Medarbejderens timeforbrug",null,null,{"$f":"IF(D48>C51*0.5,\"Praktik må maksimalt udgøre 50% af det samlede tidsforbrug.\",\" \")","v":" "}]
[null,"Samlet lønkompensation for praktikopholdet",null,{"$f":"IF(D48>C51*0.5,\"IKKE MULIGT\",D48*(IF(D8>261,260,D8)))","v":0}]
[]
[null,"Samlet tidsforbrug ",{"$f":"IF(D48+D41+D23>300,\"IKKE MULIGT\",D48+D41+D23)","v":0},{"$f":"IF(C51>300,\"Det maksimale tidsforbrug er 300 timer\",\" \")","v":" "}]
[]
[null,"Tidsforbrug til administration","Antal timer","Beløb"]
[null,"Der kan godtgøres op til 5 timer.",null,{"$f":"IF(C54>5,\"Der kan maksimalt godtgøres 5 timer pr. medarbejder.\",C54*260)","v":0}]
[]
[null,"Samlet tilsagnsramme i kr. (maksimal støtte til sporskiftepakken): ",null,{"$f":"IF(C51>300,0,MIN(D49+D44+D42+D26+D24+D54,120000))","v":0},{"$f":"IF(D56=120000,\"Det maksimale tilsagn pr. sporskiftepakke er nået, og det overstigende beløb er derfor selvbetaling.\",\"\")","v":""}]
[]
[]
[null,"Estimeret VEU-godtgørelse",null,{"$f":"D43+D25","v":0}]
[]
[null,"Selvbetaling i kr. (udgifter udover den øvre tilsagnsramme)",null,{"$f":"IF(C51>300,0,IF(D56=120000,D44+D26+D42+D49+D24+D54-120000,0))","v":0}]

{"sheet":"Medarbejder 16","index":16,"n_rows":61,"n_cols":6,"rows_kept":61,"cut":false,"hidden":true,"merged":[[6,1,6,2],[8,1,8,2],[7,1,7,2],[55,1,56,2],[8,4,8,5],[21,1,21,2],[9,1,9,2],[9,4,9,5],[10,1,10,2],[11,1,11,3],[12,1,12,3],[17,1,17,2],[18,1,18,2],[19,1,19,2],[20,1,20,2],[55,3,56,3],[16,1,16,2],[33,1,33,2],[34,1,34,2],[27,1,27,2],[28,1,28,2],[29,1,29,2],[30,1,30,2],[31,1,31,2],[32,1,32,2],[35,1,35,2],[36,1,36,2],[37,1,37,2],[38,1,38,2],[39,1,39,2]]}
[]
[null,null,"Budget/Regnskab for sporskiftepakken"]
[]
[null,null,"Oplysninger om medarbejderen"]
[]
[null,null,"Medarbejder 16"]
[null,"Medarbejderens lønkompensation fra sporskifte (kr./t.)",null,{"$f":"IF(D8>261,(IF(D11=\"Ja\",260-'Format ark'!D13,260)),IF(D8<=260,IF(D11=\"Ja\",IF(D8<'Format ark'!D13,0,D8-'Format ark'!D13),D8)))","v":0}]
[null,"Medarbejderens timesats (kr./t.)"]
[null,"Medarbejderens højst gennemførte uddannelse",null,null,{"$f":"IF(D9=\"\",\"Husk at vælge medarbejderens højst gennemførte uddannelse.\",\" \")","v":"Husk at vælge medarbejderens højst gennemførte uddannelse."}]
[null,"Har medarbejderen brugt sin uddannelse de senest 5 år?",null,null,{"$f":"IF(D10=\"\",\"Husk at svare på spørgsmålet.\",\" \")","v":"Husk at svare på spørgsmålet."}]
[null,"Medarbejder formodes at være berettiget til at få VEU-godtgørelse ",null,{"$f":"IF(OR(D9=\"Videregående uddannelse\",D9=\"Gymnasial uddannelse\")*AND(D10=\"ja\"),\"Nej\",\"Ja\")","v":"Ja"}]
[null,"Beskriv herunder hvad formålet med den planlagte sporskiftepakke er for medarbejderen:"]
[]
[]
[null,null,"Aktiviteter"]
[]
[null,"Afklaring, vejledning mv. \nSkriv navn på kursus",null,"Medarbejderens timeforbug (timer)","Evt. deltagerbetaling (kr.)","Giver kurset ret til VEU-godtgørelse?"]
[]
[]
[]
[]
[]
[null,"Samlet antal timer (udregner selv)",null,{"$f":"SUM(D18:D22)","v":0}]
[null,"Samlet lønkompensation udover evt. VEU-godtgørelse (udregner selv)",null,{"$f":"IF(D11=\"Nej\",D23*D7,0)+IF(AND(D11=\"Ja\",F18=\"Ja\"),D18*D7,0)+IF(AND(D11=\"Ja\",F19=\"Ja\"),D19*D7,0)+IF(AND(D11=\"Ja\",F20=\"Ja\"),D20*D7,0)+IF(AND(D11=\"Ja\",F21=\"Ja\"),D21*D7,0)+IF(AND(D11=\"Ja\",F22=\"Ja\"),D22*D7,0)+IF(AND(D11=\"Ja\",F18=\"Nej\"),D18*IF(D8>261,(IF(F18=\"Ja\",260-'Format ark'!D13,260)),IF(D8<=260,IF(F18=\"Ja\",D8-'Format ark'!D13,D8))),0)+IF(AND(D11=\"Ja\",F19=\"Nej\"),D19*IF(D8>261,(IF(F19=\"Ja\",260-'Format ark'!D13,260)),IF(D8<=260,IF(F19=\"Ja\",D8-'Format ark'!D13,D8))),0)+IF(AND(D11=\"Ja\",F20=\"Nej\"),D20*IF(D8>261,(IF(F20=\"Ja\",260-'Format ark'!D13,260)),IF(D8<=260,IF(F20=\"Ja\",D8-'Format ark'!D13,D8))),0)+IF(AND(D11=\"Ja\",F21=\"Nej\"),D21*IF(D8>261,(IF(F21=\"Ja\",260-'Format ark'!D13,260)),IF(D8<=260,IF(F21=\"Ja\",D8-'Format ark'!D13,D8))),0)+IF(AND(D11=\"Ja\",F22=\"Nej\"),D22*IF(D8>261,(IF(F22=\"Ja\",260-'Format ark'!D13,260)),IF(D8<=260,IF(F22=\"Ja\",D8-'Format ark'!D13,D8))),0)","v":0}]
[null,"Estimeret VEU-godtgørelse",null,{"$f":"IF(AND(D11=\"Ja\",F18=\"Ja\"),D18*'Format ark'!D13,0)+IF(AND(D11=\"Ja\",F19=\"Ja\"),D19*'Format ark'!D13,0)+IF(AND(D11=\"Ja\",F20=\"Ja\"),D20*'Format ark'!D13,0)+IF(AND(D11=\"Ja\",F21=\"Ja\"),D21*'Format ark'!D13,0)+IF(AND(D11=\"Ja\",F22=\"Ja\"),D22*'Format ark'!D13,0)","v":0}]
[null,"Samlet deltagerbeltaing (udregner selv)",null,{"$f":"SUM(E18:E22)","v":0}]
[]
[null,"Erhversrettet efteruddannelse\nSkriv navn på efteruddannelse",null,"Medarbejderens timeforbrug (timer)","Evt. deltagerbetaling (kr.)","Giver kurset ret til VEU-godtgørelse?"]
[]
[]
[]
[]
[]
[]
[]
[]
[]
[]
[]
[null,"Kørsel/transport (angives som faktisk udgift)",null,null,null,"Nej"]
[null,"Samlet antal timer (udregner selv)",null,{"$f":"SUM(D29:D40)","v":0}]
[null,"Samlet lønkompensation udover evt. VEU-godtgørelse (udregner selv)",null,{"$f":"IF(D11=\"Nej\",D41*D7,0)+IF(AND(D11=\"Ja\",F29=\"Ja\"),D29*D7,0)+IF(AND(D11=\"Ja\",F30=\"Ja\"),D30*D7,0)+IF(AND(D11=\"Ja\",F31=\"Ja\"),D31*D7,0)+IF(AND(D11=\"Ja\",F32=\"Ja\"),D32*D7,0)+IF(AND(D11=\"Ja\",F33=\"Ja\"),D33*D7,0)+IF(AND(D11=\"Ja\",F34=\"Ja\"),D34*D7,0)+IF(AND(D11=\"Ja\",F35=\"Ja\"),D35*D7,0)+IF(AND(D11=\"Ja\",F36=\"Ja\"),D36*D7,0)+IF(AND(D11=\"Ja\",F37=\"Ja\"),D37*D7,0)+IF(AND(D11=\"Ja\",F38=\"Ja\"),D38*D7,0)+IF(AND(D11=\"Ja\",F39=\"Ja\"),D39*D7,0)+IF(AND(D11=\"Ja\",F40=\"Ja\"),D40*D7,0)+IF(AND(D11=\"Ja\",F29=\"Nej\"),D29* IF(D8>261,(IF(F29=\"Ja\",260-'Format ark'!D13,260)),IF(D8<=260,IF(F29=\"Ja\",D8-'Format ark'!D13,D8))),0)+IF(AND(D11=\"Ja\",F30=\"Nej\"),D30* IF(D8>261,(IF(F30=\"Ja\",260-'Format ark'!D13,260)),IF(D8<=260,IF(F30=\"Ja\",D8-'Format ark'!D13,D8))),0)+IF(AND(D11=\"Ja\",F31=\"Nej\"),D31* IF(D8>261,(IF(F31=\"Ja\",260-'Format ark'!D13,260)),IF(D8<=260,IF(F31=\"Ja\",D8-'Format ark'!D13,D8))),0)+IF(AND(D11=\"Ja\",F32=\"Nej\"),D32* IF(D8>261,(IF(F32=\"Ja\",260-'Format ark'!D13,260)),IF(D8<=260,IF(F32=\"Ja\",D8-'Format ark'!D13,D8))),0)+IF(AND(D11=\"Ja\",F33=\"Nej\"),D33* IF(D8>261,(IF(F33=\"Ja\",260-'Format ark'!D13,260)),IF(D8<=260,IF(F33=\"Ja\",D8-'Format ark'!D13,D8))),0)+IF(AND(D11=\"Ja\",F34=\"Nej\"),D34* IF(D8>261,(IF(F34=\"Ja\",260-'Format ark'!D13,260)),IF(D8<=260,IF(F34=\"Ja\",D8-'Format ark'!D13,D8))),0)+IF(AND(D11=\"Ja\",F35=\"Nej\"),D35* IF(D8>261,(IF(F35=\"Ja\",260-'Format ark'!D13,260)),IF(D8<=260,IF(F35=\"Ja\",D8-'Format ark'!D13,D8))),0)+IF(AND(D11=\"Ja\",F36=\"Nej\"),D36* IF(D8>261,(IF(F36=\"Ja\",260-'Format ark'!D13,260)),IF(D8<=260,IF(F36=\"Ja\",D8-'Format ark'!D13,D8))),0)+IF(AND(D11=\"Ja\",F37=\"Nej\"),D37* IF(D8>261,(IF(F37=\"Ja\",260-'Format ark'!D13,260)),IF(D8<=260,IF(F37=\"Ja\",D8-'Format ark'!D13,D8))),0)+IF(AND(D11=\"Ja\",F38=\"Nej\"),D38* IF(D8>261,(IF(F38=\"Ja\",260-'Format ark'!D13,260)),IF(D8<=260,IF(F38=\"Ja\",D8-'Format ark'!D13,D8))),0)+IF(AND(D11=\"Ja\",F39=\"Nej\"),D39* IF(D8>261,(IF(F39=\"Ja\",260-'Format ark'!D13,260)),IF(D8<=260,IF(F39=\"Ja\",D8-'Format ark'!D13,D8))),0)+IF(AND(D11=\"Ja\",F40=\"Nej\"),D40* IF(D8>261,(IF(F40=\"Ja\",260-'Format ark'!D13,260)),IF(D8<=260,IF(F40=\"Ja\",D8-'Format ark'!D13,D8))),0)","v":0}]
[null,"Estimeret VEU-godtgørelse",null,{"$f":"IF(AND(D11=\"Ja\",F29=\"Ja\"),D29*'Format ark'!D13,0)+IF(AND(D11=\"Ja\",F30=\"Ja\"),D30*'Format ark'!D13,0)+IF(AND(D11=\"Ja\",F31=\"Ja\"),D31*'Format ark'!D13,0)+IF(AND(D11=\"Ja\",F32=\"Ja\"),D32*('Format ark'!D13),0)+IF(AND(D11=\"Ja\",F33=\"Ja\"),D33*'Format ark'!D13,0)+IF(AND(D11=\"Ja\",F34=\"Ja\"),D34*'Format ark'!D13,0)+IF(AND(D11=\"Ja\",F35=\"Ja\"),D35*'Format ark'!D13,0)+IF(AND(D11=\"Ja\",F36=\"Ja\"),D36*'Format ark'!D13,0)+IF(AND(D11=\"Ja\",F37=\"Ja\"),D37*'Format ark'!D13,0)+IF(AND(D11=\"Ja\",F38=\"Ja\"),D38*'Format ark'!D13,0)+IF(AND(D11=\"Ja\",F39=\"Ja\"),D39*'Format ark'!D13,0)+IF(AND(D11=\"Ja\",F40=\"Ja\"),D40*'Format ark'!D13,0)","v":0}]
[null,"Samlet deltagerbetaling (udregner selv)",null,{"$f":"SUM(E29:E40)","v":0}]
[]
[null,"Praktik"]
[null,"Navn på virksomhed og p-nummer"]
[null,"Medarbejderens timeforbrug",null,null,{"$f":"IF(D48>C51*0.5,\"Praktik må maksimalt udgøre 50% af det samlede tidsforbrug.\",\" \")","v":" "}]
[null,"Samlet lønkompensation for praktikopholdet",null,{"$f":"IF(D48>C51*0.5,\"IKKE MULIGT\",D48*(IF(D8>261,260,D8)))","v":0}]
[]
[null,"Samlet tidsforbrug ",{"$f":"IF(D48+D41+D23>300,\"IKKE MULIGT\",D48+D41+D23)","v":0},{"$f":"IF(C51>300,\"Det maksimale tidsforbrug er 300 timer\",\" \")","v":" "}]
[]
[null,"Tidsforbrug til administration","Antal timer","Beløb"]
[null,"Der kan godtgøres op til 5 timer.",null,{"$f":"IF(C54>5,\"Der kan maksimalt godtgøres 5 timer pr. medarbejder.\",C54*260)","v":0}]
[]
[null,"Samlet tilsagnsramme i kr. (maksimal støtte til sporskiftepakken): ",null,{"$f":"IF(C51>300,0,MIN(D49+D44+D42+D26+D24+D54,120000))","v":0},{"$f":"IF(D56=120000,\"Det maksimale tilsagn pr. sporskiftepakke er nået, og det overstigende beløb er derfor selvbetaling.\",\"\")","v":""}]
[]
[]
[null,"Estimeret VEU-godtgørelse",null,{"$f":"D43+D25","v":0}]
[]
[null,"Selvbetaling i kr. (udgifter udover den øvre tilsagnsramme)",null,{"$f":"IF(C51>300,0,IF(D56=120000,D44+D26+D42+D49+D24+D54-120000,0))","v":0}]

{"sheet":"Medarbejder 17","index":17,"n_rows":61,"n_cols":6,"rows_kept":61,"cut":false,"hidden":true,"merged":[[6,1,6,2],[8,1,8,2],[7,1,7,2],[55,1,56,2],[8,4,8,5],[21,1,21,2],[9,1,9,2],[9,4,9,5],[10,1,10,2],[11,1,11,3],[12,1,12,3],[17,1,17,2],[18,1,18,2],[19,1,19,2],[20,1,20,2],[55,3,56,3],[16,1,16,2],[33,1,33,2],[34,1,34,2],[27,1,27,2],[28,1,28,2],[29,1,29,2],[30,1,30,2],[31,1,31,2],[32,1,32,2],[35,1,35,2],[36,1,36,2],[37,1,37,2],[38,1,38,2],[39,1,39,2]]}
[]
[null,null,"Budget/Regnskab for sporskiftepakken"]
[]
[null,null,"Oplysninger om medarbejderen"]
[]
[null,null,"Medarbejder 17"]
[null,"Medarbejderens lønkompensation fra sporskifte (kr./t.)",null,{"$f":"IF(D8>261,(IF(D11=\"Ja\",260-'Format ark'!D13,260)),IF(D8<=260,IF(D11=\"Ja\",IF(D8<'Format ark'!D13,0,D8-'Format ark'!D13),D8)))","v":0}]
[null,"Medarbejderens timesats (kr./t.)"]
[null,"Medarbejderens højst gennemførte uddannelse",null,null,{"$f":"IF(D9=\"\",\"Husk at vælge medarbejderens højst gennemførte uddannelse.\",\" \")","v":"Husk at vælge medarbejderens højst gennemførte uddannelse."}]
[null,"Har medarbejderen brugt sin uddannelse de senest 5 år?",null,null,{"$f":"IF(D10=\"\",\"Husk at svare på spørgsmålet.\",\" \")","v":"Husk at svare på spørgsmålet."}]
[null,"Medarbejder formodes at være berettiget til at få VEU-godtgørelse ",null,{"$f":"IF(OR(D9=\"Videregående uddannelse\",D9=\"Gymnasial uddannelse\")*AND(D10=\"ja\"),\"Nej\",\"Ja\")","v":"Ja"}]
[null,"Beskriv herunder hvad formålet med den planlagte sporskiftepakke er for medarbejderen:"]
[]
[]
[null,null,"Aktiviteter"]
[]
[null,"Afklaring, vejledning mv. \nSkriv navn på kursus",null,"Medarbejderens timeforbug (timer)","Evt. deltagerbetaling (kr.)","Giver kurset ret til VEU-godtgørelse?"]
[]
[]
[]
[]
[]
[null,"Samlet antal timer (udregner selv)",null,{"$f":"SUM(D18:D22)","v":0}]
[null,"Samlet lønkompensation udover evt. VEU-godtgørelse (udregner selv)",null,{"$f":"IF(D11=\"Nej\",D23*D7,0)+IF(AND(D11=\"Ja\",F18=\"Ja\"),D18*D7,0)+IF(AND(D11=\"Ja\",F19=\"Ja\"),D19*D7,0)+IF(AND(D11=\"Ja\",F20=\"Ja\"),D20*D7,0)+IF(AND(D11=\"Ja\",F21=\"Ja\"),D21*D7,0)+IF(AND(D11=\"Ja\",F22=\"Ja\"),D22*D7,0)+IF(AND(D11=\"Ja\",F18=\"Nej\"),D18*IF(D8>261,(IF(F18=\"Ja\",260-'Format ark'!D13,260)),IF(D8<=260,IF(F18=\"Ja\",D8-'Format ark'!D13,D8))),0)+IF(AND(D11=\"Ja\",F19=\"Nej\"),D19*IF(D8>261,(IF(F19=\"Ja\",260-'Format ark'!D13,260)),IF(D8<=260,IF(F19=\"Ja\",D8-'Format ark'!D13,D8))),0)+IF(AND(D11=\"Ja\",F20=\"Nej\"),D20*IF(D8>261,(IF(F20=\"Ja\",260-'Format ark'!D13,260)),IF(D8<=260,IF(F20=\"Ja\",D8-'Format ark'!D13,D8))),0)+IF(AND(D11=\"Ja\",F21=\"Nej\"),D21*IF(D8>261,(IF(F21=\"Ja\",260-'Format ark'!D13,260)),IF(D8<=260,IF(F21=\"Ja\",D8-'Format ark'!D13,D8))),0)+IF(AND(D11=\"Ja\",F22=\"Nej\"),D22*IF(D8>261,(IF(F22=\"Ja\",260-'Format ark'!D13,260)),IF(D8<=260,IF(F22=\"Ja\",D8-'Format ark'!D13,D8))),0)","v":0}]
[null,"Estimeret VEU-godtgørelse",null,{"$f":"IF(AND(D11=\"Ja\",F18=\"Ja\"),D18*'Format ark'!D13,0)+IF(AND(D11=\"Ja\",F19=\"Ja\"),D19*'Format ark'!D13,0)+IF(AND(D11=\"Ja\",F20=\"Ja\"),D20*'Format ark'!D13,0)+IF(AND(D11=\"Ja\",F21=\"Ja\"),D21*'Format ark'!D13,0)+IF(AND(D11=\"Ja\",F22=\"Ja\"),D22*'Format ark'!D13,0)","v":0}]
[null,"Samlet deltagerbeltaing (udregner selv)",null,{"$f":"SUM(E18:E22)","v":0}]
[]
[null,"Erhversrettet efteruddannelse\nSkriv navn på efteruddannelse",null,"Medarbejderens timeforbrug (timer)","Evt. deltagerbetaling (kr.)","Giver kurset ret til VEU-godtgørelse?"]
[]
[]
[]
[]
[]
[]
[]
[]
[]
[]
[]
[null,"Kørsel/transport (angives som faktisk udgift)",null,null,null,"Nej"]
[null,"Samlet antal timer (udregner selv)",null,{"$f":"SUM(D29:D40)","v":0}]
[null,"Samlet lønkompensation udover evt. VEU-godtgørelse (udregner selv)",null,{"$f":"IF(D11=\"Nej\",D41*D7,0)+IF(AND(D11=\"Ja\",F29=\"Ja\"),D29*D7,0)+IF(AND(D11=\"Ja\",F30=\"Ja\"),D30*D7,0)+IF(AND(D11=\"Ja\",F31=\"Ja\"),D31*D7,0)+IF(AND(D11=\"Ja\",F32=\"Ja\"),D32*D7,0)+IF(AND(D11=\"Ja\",F33=\"Ja\"),D33*D7,0)+IF(AND(D11=\"Ja\",F34=\"Ja\"),D34*D7,0)+IF(AND(D11=\"Ja\",F35=\"Ja\"),D35*D7,0)+IF(AND(D11=\"Ja\",F36=\"Ja\"),D36*D7,0)+IF(AND(D11=\"Ja\",F37=\"Ja\"),D37*D7,0)+IF(AND(D11=\"Ja\",F38=\"Ja\"),D38*D7,0)+IF(AND(D11=\"Ja\",F39=\"Ja\"),D39*D7,0)+IF(AND(D11=\"Ja\",F40=\"Ja\"),D40*D7,0)+IF(AND(D11=\"Ja\",F29=\"Nej\"),D29* IF(D8>261,(IF(F29=\"Ja\",260-'Format ark'!D13,260)),IF(D8<=260,IF(F29=\"Ja\",D8-'Format ark'!D13,D8))),0)+IF(AND(D11=\"Ja\",F30=\"Nej\"),D30* IF(D8>261,(IF(F30=\"Ja\",260-'Format ark'!D13,260)),IF(D8<=260,IF(F30=\"Ja\",D8-'Format ark'!D13,D8))),0)+IF(AND(D11=\"Ja\",F31=\"Nej\"),D31* IF(D8>261,(IF(F31=\"Ja\",260-'Format ark'!D13,260)),IF(D8<=260,IF(F31=\"Ja\",D8-'Format ark'!D13,D8))),0)+IF(AND(D11=\"Ja\",F32=\"Nej\"),D32* IF(D8>261,(IF(F32=\"Ja\",260-'Format ark'!D13,260)),IF(D8<=260,IF(F32=\"Ja\",D8-'Format ark'!D13,D8))),0)+IF(AND(D11=\"Ja\",F33=\"Nej\"),D33* IF(D8>261,(IF(F33=\"Ja\",260-'Format ark'!D13,260)),IF(D8<=260,IF(F33=\"Ja\",D8-'Format ark'!D13,D8))),0)+IF(AND(D11=\"Ja\",F34=\"Nej\"),D34* IF(D8>261,(IF(F34=\"Ja\",260-'Format ark'!D13,260)),IF(D8<=260,IF(F34=\"Ja\",D8-'Format ark'!D13,D8))),0)+IF(AND(D11=\"Ja\",F35=\"Nej\"),D35* IF(D8>261,(IF(F35=\"Ja\",260-'Format ark'!D13,260)),IF(D8<=260,IF(F35=\"Ja\",D8-'Format ark'!D13,D8))),0)+IF(AND(D11=\"Ja\",F36=\"Nej\"),D36* IF(D8>261,(IF(F36=\"Ja\",260-'Format ark'!D13,260)),IF(D8<=260,IF(F36=\"Ja\",D8-'Format ark'!D13,D8))),0)+IF(AND(D11=\"Ja\",F37=\"Nej\"),D37* IF(D8>261,(IF(F37=\"Ja\",260-'Format ark'!D13,260)),IF(D8<=260,IF(F37=\"Ja\",D8-'Format ark'!D13,D8))),0)+IF(AND(D11=\"Ja\",F38=\"Nej\"),D38* IF(D8>261,(IF(F38=\"Ja\",260-'Format ark'!D13,260)),IF(D8<=260,IF(F38=\"Ja\",D8-'Format ark'!D13,D8))),0)+IF(AND(D11=\"Ja\",F39=\"Nej\"),D39* IF(D8>261,(IF(F39=\"Ja\",260-'Format ark'!D13,260)),IF(D8<=260,IF(F39=\"Ja\",D8-'Format ark'!D13,D8))),0)+IF(AND(D11=\"Ja\",F40=\"Nej\"),D40* IF(D8>261,(IF(F40=\"Ja\",260-'Format ark'!D13,260)),IF(D8<=260,IF(F40=\"Ja\",D8-'Format ark'!D13,D8))),0)","v":0}]
[null,"Estimeret VEU-godtgørelse",null,{"$f":"IF(AND(D11=\"Ja\",F29=\"Ja\"),D29*'Format ark'!D13,0)+IF(AND(D11=\"Ja\",F30=\"Ja\"),D30*'Format ark'!D13,0)+IF(AND(D11=\"Ja\",F31=\"Ja\"),D31*'Format ark'!D13,0)+IF(AND(D11=\"Ja\",F32=\"Ja\"),D32*('Format ark'!D13),0)+IF(AND(D11=\"Ja\",F33=\"Ja\"),D33*'Format ark'!D13,0)+IF(AND(D11=\"Ja\",F34=\"Ja\"),D34*'Format ark'!D13,0)+IF(AND(D11=\"Ja\",F35=\"Ja\"),D35*'Format ark'!D13,0)+IF(AND(D11=\"Ja\",F36=\"Ja\"),D36*'Format ark'!D13,0)+IF(AND(D11=\"Ja\",F37=\"Ja\"),D37*'Format ark'!D13,0)+IF(AND(D11=\"Ja\",F38=\"Ja\"),D38*'Format ark'!D13,0)+IF(AND(D11=\"Ja\",F39=\"Ja\"),D39*'Format ark'!D13,0)+IF(AND(D11=\"Ja\",F40=\"Ja\"),D40*'Format ark'!D13,0)","v":0}]
[null,"Samlet deltagerbetaling (udregner selv)",null,{"$f":"SUM(E29:E40)","v":0}]
[]
[null,"Praktik"]
[null,"Navn på virksomhed og p-nummer"]
[null,"Medarbejderens timeforbrug",null,null,{"$f":"IF(D48>C51*0.5,\"Praktik må maksimalt udgøre 50% af det samlede tidsforbrug.\",\" \")","v":" "}]
[null,"Samlet lønkompensation for praktikopholdet",null,{"$f":"IF(D48>C51*0.5,\"IKKE MULIGT\",D48*(IF(D8>261,260,D8)))","v":0}]
[]
[null,"Samlet tidsforbrug ",{"$f":"IF(D48+D41+D23>300,\"IKKE MULIGT\",D48+D41+D23)","v":0},{"$f":"IF(C51>300,\"Det maksimale tidsforbrug er 300 timer\",\" \")","v":" "}]
[]
[null,"Tidsforbrug til administration","Antal timer","Beløb"]
[null,"Der kan godtgøres op til 5 timer.",null,{"$f":"IF(C54>5,\"Der kan maksimalt godtgøres 5 timer pr. medarbejder.\",C54*260)","v":0}]
[]
[null,"Samlet tilsagnsramme i kr. (maksimal støtte til sporskiftepakken): ",null,{"$f":"IF(C51>300,0,MIN(D49+D44+D42+D26+D24+D54,120000))","v":0},{"$f":"IF(D56=120000,\"Det maksimale tilsagn pr. sporskiftepakke er nået, og det overstigende beløb er derfor selvbetaling.\",\"\")","v":""}]
[]
[]
[null,"Estimeret VEU-godtgørelse",null,{"$f":"D43+D25","v":0}]
[]
[null,"Selvbetaling i kr. (udgifter udover den øvre tilsagnsramme)",null,{"$f":"IF(C51>300,0,IF(D56=120000,D44+D26+D42+D49+D24+D54-120000,0))","v":0}]

{"sheet":"Medarbejder 18","index":18,"n_rows":61,"n_cols":6,"rows_kept":61,"cut":false,"hidden":true,"merged":[[6,1,6,2],[8,1,8,2],[7,1,7,2],[55,1,56,2],[8,4,8,5],[21,1,21,2],[9,1,9,2],[9,4,9,5],[10,1,10,2],[11,1,11,3],[12,1,12,3],[17,1,17,2],[18,1,18,2],[19,1,19,2],[20,1,20,2],[55,3,56,3],[16,1,16,2],[33,1,33,2],[34,1,34,2],[27,1,27,2],[28,1,28,2],[29,1,29,2],[30,1,30,2],[31,1,31,2],[32,1,32,2],[35,1,35,2],[36,1,36,2],[37,1,37,2],[38,1,38,2],[39,1,39,2]]}
[]
[null,null,"Budget/Regnskab for sporskiftepakken"]
[]
[null,null,"Oplysninger om medarbejderen"]
[]
[null,null,"Medarbejder 18"]
[null,"Medarbejderens lønkompensation fra sporskifte (kr./t.)",null,{"$f":"IF(D8>261,(IF(D11=\"Ja\",260-'Format ark'!D13,260)),IF(D8<=260,IF(D11=\"Ja\",IF(D8<'Format ark'!D13,0,D8-'Format ark'!D13),D8)))","v":0}]
[null,"Medarbejderens timesats (kr./t.)"]
[null,"Medarbejderens højst gennemførte uddannelse",null,null,{"$f":"IF(D9=\"\",\"Husk at vælge medarbejderens højst gennemførte uddannelse.\",\" \")","v":"Husk at vælge medarbejderens højst gennemførte uddannelse."}]
[null,"Har medarbejderen brugt sin uddannelse de senest 5 år?",null,null,{"$f":"IF(D10=\"\",\"Husk at svare på spørgsmålet.\",\" \")","v":"Husk at svare på spørgsmålet."}]
[null,"Medarbejder formodes at være berettiget til at få VEU-godtgørelse ",null,{"$f":"IF(OR(D9=\"Videregående uddannelse\",D9=\"Gymnasial uddannelse\")*AND(D10=\"ja\"),\"Nej\",\"Ja\")","v":"Ja"}]
[null,"Beskriv herunder hvad formålet med den planlagte sporskiftepakke er for medarbejderen:"]
[]
[]
[null,null,"Aktiviteter"]
[]
[null,"Afklaring, vejledning mv. \nSkriv navn på kursus",null,"Medarbejderens timeforbug (timer)","Evt. deltagerbetaling (kr.)","Giver kurset ret til VEU-godtgørelse?"]
[]
[]
[]
[]
[]
[null,"Samlet antal timer (udregner selv)",null,{"$f":"SUM(D18:D22)","v":0}]
[null,"Samlet lønkompensation udover evt. VEU-godtgørelse (udregner selv)",null,{"$f":"IF(D11=\"Nej\",D23*D7,0)+IF(AND(D11=\"Ja\",F18=\"Ja\"),D18*D7,0)+IF(AND(D11=\"Ja\",F19=\"Ja\"),D19*D7,0)+IF(AND(D11=\"Ja\",F20=\"Ja\"),D20*D7,0)+IF(AND(D11=\"Ja\",F21=\"Ja\"),D21*D7,0)+IF(AND(D11=\"Ja\",F22=\"Ja\"),D22*D7,0)+IF(AND(D11=\"Ja\",F18=\"Nej\"),D18*IF(D8>261,(IF(F18=\"Ja\",260-'Format ark'!D13,260)),IF(D8<=260,IF(F18=\"Ja\",D8-'Format ark'!D13,D8))),0)+IF(AND(D11=\"Ja\",F19=\"Nej\"),D19*IF(D8>261,(IF(F19=\"Ja\",260-'Format ark'!D13,260)),IF(D8<=260,IF(F19=\"Ja\",D8-'Format ark'!D13,D8))),0)+IF(AND(D11=\"Ja\",F20=\"Nej\"),D20*IF(D8>261,(IF(F20=\"Ja\",260-'Format ark'!D13,260)),IF(D8<=260,IF(F20=\"Ja\",D8-'Format ark'!D13,D8))),0)+IF(AND(D11=\"Ja\",F21=\"Nej\"),D21*IF(D8>261,(IF(F21=\"Ja\",260-'Format ark'!D13,260)),IF(D8<=260,IF(F21=\"Ja\",D8-'Format ark'!D13,D8))),0)+IF(AND(D11=\"Ja\",F22=\"Nej\"),D22*IF(D8>261,(IF(F22=\"Ja\",260-'Format ark'!D13,260)),IF(D8<=260,IF(F22=\"Ja\",D8-'Format ark'!D13,D8))),0)","v":0}]
[null,"Estimeret VEU-godtgørelse",null,{"$f":"IF(AND(D11=\"Ja\",F18=\"Ja\"),D18*'Format ark'!D13,0)+IF(AND(D11=\"Ja\",F19=\"Ja\"),D19*'Format ark'!D13,0)+IF(AND(D11=\"Ja\",F20=\"Ja\"),D20*'Format ark'!D13,0)+IF(AND(D11=\"Ja\",F21=\"Ja\"),D21*'Format ark'!D13,0)+IF(AND(D11=\"Ja\",F22=\"Ja\"),D22*'Format ark'!D13,0)","v":0}]
[null,"Samlet deltagerbeltaing (udregner selv)",null,{"$f":"SUM(E18:E22)","v":0}]
[]
[null,"Erhversrettet efteruddannelse\nSkriv navn på efteruddannelse",null,"Medarbejderens timeforbrug (timer)","Evt. deltagerbetaling (kr.)","Giver kurset ret til VEU-godtgørelse?"]
[]
[]
[]
[]
[]
[]
[]
[]
[]
[]
[]
[null,"Kørsel/transport (angives som faktisk udgift)",null,null,null,"Nej"]
[null,"Samlet antal timer (udregner selv)",null,{"$f":"SUM(D29:D40)","v":0}]
[null,"Samlet lønkompensation udover evt. VEU-godtgørelse (udregner selv)",null,{"$f":"IF(D11=\"Nej\",D41*D7,0)+IF(AND(D11=\"Ja\",F29=\"Ja\"),D29*D7,0)+IF(AND(D11=\"Ja\",F30=\"Ja\"),D30*D7,0)+IF(AND(D11=\"Ja\",F31=\"Ja\"),D31*D7,0)+IF(AND(D11=\"Ja\",F32=\"Ja\"),D32*D7,0)+IF(AND(D11=\"Ja\",F33=\"Ja\"),D33*D7,0)+IF(AND(D11=\"Ja\",F34=\"Ja\"),D34*D7,0)+IF(AND(D11=\"Ja\",F35=\"Ja\"),D35*D7,0)+IF(AND(D11=\"Ja\",F36=\"Ja\"),D36*D7,0)+IF(AND(D11=\"Ja\",F37=\"Ja\"),D37*D7,0)+IF(AND(D11=\"Ja\",F38=\"Ja\"),D38*D7,0)+IF(AND(D11=\"Ja\",F39=\"Ja\"),D39*D7,0)+IF(AND(D11=\"Ja\",F40=\"Ja\"),D40*D7,0)+IF(AND(D11=\"Ja\",F29=\"Nej\"),D29* IF(D8>261,(IF(F29=\"Ja\",260-'Format ark'!D13,260)),IF(D8<=260,IF(F29=\"Ja\",D8-'Format ark'!D13,D8))),0)+IF(AND(D11=\"Ja\",F30=\"Nej\"),D30* IF(D8>261,(IF(F30=\"Ja\",260-'Format ark'!D13,260)),IF(D8<=260,IF(F30=\"Ja\",D8-'Format ark'!D13,D8))),0)+IF(AND(D11=\"Ja\",F31=\"Nej\"),D31* IF(D8>261,(IF(F31=\"Ja\",260-'Format ark'!D13,260)),IF(D8<=260,IF(F31=\"Ja\",D8-'Format ark'!D13,D8))),0)+IF(AND(D11=\"Ja\",F32=\"Nej\"),D32* IF(D8>261,(IF(F32=\"Ja\",260-'Format ark'!D13,260)),IF(D8<=260,IF(F32=\"Ja\",D8-'Format ark'!D13,D8))),0)+IF(AND(D11=\"Ja\",F33=\"Nej\"),D33* IF(D8>261,(IF(F33=\"Ja\",260-'Format ark'!D13,260)),IF(D8<=260,IF(F33=\"Ja\",D8-'Format ark'!D13,D8))),0)+IF(AND(D11=\"Ja\",F34=\"Nej\"),D34* IF(D8>261,(IF(F34=\"Ja\",260-'Format ark'!D13,260)),IF(D8<=260,IF(F34=\"Ja\",D8-'Format ark'!D13,D8))),0)+IF(AND(D11=\"Ja\",F35=\"Nej\"),D35* IF(D8>261,(IF(F35=\"Ja\",260-'Format ark'!D13,260)),IF(D8<=260,IF(F35=\"Ja\",D8-'Format ark'!D13,D8))),0)+IF(AND(D11=\"Ja\",F36=\"Nej\"),D36* IF(D8>261,(IF(F36=\"Ja\",260-'Format ark'!D13,260)),IF(D8<=260,IF(F36=\"Ja\",D8-'Format ark'!D13,D8))),0)+IF(AND(D11=\"Ja\",F37=\"Nej\"),D37* IF(D8>261,(IF(F37=\"Ja\",260-'Format ark'!D13,260)),IF(D8<=260,IF(F37=\"Ja\",D8-'Format ark'!D13,D8))),0)+IF(AND(D11=\"Ja\",F38=\"Nej\"),D38* IF(D8>261,(IF(F38=\"Ja\",260-'Format ark'!D13,260)),IF(D8<=260,IF(F38=\"Ja\",D8-'Format ark'!D13,D8))),0)+IF(AND(D11=\"Ja\",F39=\"Nej\"),D39* IF(D8>261,(IF(F39=\"Ja\",260-'Format ark'!D13,260)),IF(D8<=260,IF(F39=\"Ja\",D8-'Format ark'!D13,D8))),0)+IF(AND(D11=\"Ja\",F40=\"Nej\"),D40* IF(D8>261,(IF(F40=\"Ja\",260-'Format ark'!D13,260)),IF(D8<=260,IF(F40=\"Ja\",D8-'Format ark'!D13,D8))),0)","v":0}]
[null,"Estimeret VEU-godtgørelse",null,{"$f":"IF(AND(D11=\"Ja\",F29=\"Ja\"),D29*'Format ark'!D13,0)+IF(AND(D11=\"Ja\",F30=\"Ja\"),D30*'Format ark'!D13,0)+IF(AND(D11=\"Ja\",F31=\"Ja\"),D31*'Format ark'!D13,0)+IF(AND(D11=\"Ja\",F32=\"Ja\"),D32*('Format ark'!D13),0)+IF(AND(D11=\"Ja\",F33=\"Ja\"),D33*'Format ark'!D13,0)+IF(AND(D11=\"Ja\",F34=\"Ja\"),D34*'Format ark'!D13,0)+IF(AND(D11=\"Ja\",F35=\"Ja\"),D35*'Format ark'!D13,0)+IF(AND(D11=\"Ja\",F36=\"Ja\"),D36*'Format ark'!D13,0)+IF(AND(D11=\"Ja\",F37=\"Ja\"),D37*'Format ark'!D13,0)+IF(AND(D11=\"Ja\",F38=\"Ja\"),D38*'Format ark'!D13,0)+IF(AND(D11=\"Ja\",F39=\"Ja\"),D39*'Format ark'!D13,0)+IF(AND(D11=\"Ja\",F40=\"Ja\"),D40*'Format ark'!D13,0)","v":0}]
[null,"Samlet deltagerbetaling (udregner selv)",null,{"$f":"SUM(E29:E40)","v":0}]
[]
[null,"Praktik"]
[null,"Navn på virksomhed og p-nummer"]
[null,"Medarbejderens timeforbrug",null,null,{"$f":"IF(D48>C51*0.5,\"Praktik må maksimalt udgøre 50% af det samlede tidsforbrug.\",\" \")","v":" "}]
[null,"Samlet lønkompensation for praktikopholdet",null,{"$f":"IF(D48>C51*0.5,\"IKKE MULIGT\",D48*(IF(D8>261,260,D8)))","v":0}]
[]
[null,"Samlet tidsforbrug ",{"$f":"IF(D48+D41+D23>300,\"IKKE MULIGT\",D48+D41+D23)","v":0},{"$f":"IF(C51>300,\"Det maksimale tidsforbrug er 300 timer\",\" \")","v":" "}]
[]
[null,"Tidsforbrug til administration","Antal timer","Beløb"]
[null,"Der kan godtgøres op til 5 timer.",null,{"$f":"IF(C54>5,\"Der kan maksimalt godtgøres 5 timer pr. medarbejder.\",C54*260)","v":0}]
[]
[null,"Samlet tilsagnsramme i kr. (maksimal støtte til sporskiftepakken): ",null,{"$f":"IF(C51>300,0,MIN(D49+D44+D42+D26+D24+D54,120000))","v":0},{"$f":"IF(D56=120000,\"Det maksimale tilsagn pr. sporskiftepakke er nået, og det overstigende beløb er derfor selvbetaling.\",\"\")","v":""}]
[]
[]
[null,"Estimeret VEU-godtgørelse",null,{"$f":"D43+D25","v":0}]
[]
[null,"Selvbetaling i kr. (udgifter udover den øvre tilsagnsramme)",null,{"$f":"IF(C51>300,0,IF(D56=120000,D44+D26+D42+D49+D24+D54-120000,0))","v":0}]

{"sheet":"Medarbejder 19","index":19,"n_rows":61,"n_cols":6,"rows_kept":61,"cut":false,"hidden":true,"merged":[[6,1,6,2],[8,1,8,2],[7,1,7,2],[55,1,56,2],[8,4,8,5],[21,1,21,2],[9,1,9,2],[9,4,9,5],[10,1,10,2],[11,1,11,3],[12,1,12,3],[17,1,17,2],[18,1,18,2],[19,1,19,2],[20,1,20,2],[55,3,56,3],[16,1,16,2],[33,1,33,2],[34,1,34,2],[27,1,27,2],[28,1,28,2],[29,1,29,2],[30,1,30,2],[31,1,31,2],[32,1,32,2],[35,1,35,2],[36,1,36,2],[37,1,37,2],[38,1,38,2],[39,1,39,2]]}
[]
[null,null,"Budget/Regnskab for sporskiftepakken"]
[]
[null,null,"Oplysninger om medarbejderen"]
[]
[null,null,"Medarbejder 19"]
[null,"Medarbejderens lønkompensation fra sporskifte (kr./t.)",null,{"$f":"IF(D8>261,(IF(D11=\"Ja\",260-'Format ark'!D13,260)),IF(D8<=260,IF(D11=\"Ja\",IF(D8<'Format ark'!D13,0,D8-'Format ark'!D13),D8)))","v":0}]
[null,"Medarbejderens timesats (kr./t.)"]
[null,"Medarbejderens højst gennemførte uddannelse",null,null,{"$f":"IF(D9=\"\",\"Husk at vælge medarbejderens højst gennemførte uddannelse.\",\" \")","v":"Husk at vælge medarbejderens højst gennemførte uddannelse."}]
[null,"Har medarbejderen brugt sin uddannelse de senest 5 år?",null,null,{"$f":"IF(D10=\"\",\"Husk at svare på spørgsmålet.\",\" \")","v":"Husk at svare på spørgsmålet."}]
[null,"Medarbejder formodes at være berettiget til at få VEU-godtgørelse ",null,{"$f":"IF(OR(D9=\"Videregående uddannelse\",D9=\"Gymnasial uddannelse\")*AND(D10=\"ja\"),\"Nej\",\"Ja\")","v":"Ja"}]
[null,"Beskriv herunder hvad formålet med den planlagte sporskiftepakke er for medarbejderen:"]
[]
[]
[null,null,"Aktiviteter"]
[]
[null,"Afklaring, vejledning mv. \nSkriv navn på kursus",null,"Medarbejderens timeforbug (timer)","Evt. deltagerbetaling (kr.)","Giver kurset ret til VEU-godtgørelse?"]
[]
[]
[]
[]
[]
[null,"Samlet antal timer (udregner selv)",null,{"$f":"SUM(D18:D22)","v":0}]
[null,"Samlet lønkompensation udover evt. VEU-godtgørelse (udregner selv)",null,{"$f":"IF(D11=\"Nej\",D23*D7,0)+IF(AND(D11=\"Ja\",F18=\"Ja\"),D18*D7,0)+IF(AND(D11=\"Ja\",F19=\"Ja\"),D19*D7,0)+IF(AND(D11=\"Ja\",F20=\"Ja\"),D20*D7,0)+IF(AND(D11=\"Ja\",F21=\"Ja\"),D21*D7,0)+IF(AND(D11=\"Ja\",F22=\"Ja\"),D22*D7,0)+IF(AND(D11=\"Ja\",F18=\"Nej\"),D18*IF(D8>261,(IF(F18=\"Ja\",260-'Format ark'!D13,260)),IF(D8<=260,IF(F18=\"Ja\",D8-'Format ark'!D13,D8))),0)+IF(AND(D11=\"Ja\",F19=\"Nej\"),D19*IF(D8>261,(IF(F19=\"Ja\",260-'Format ark'!D13,260)),IF(D8<=260,IF(F19=\"Ja\",D8-'Format ark'!D13,D8))),0)+IF(AND(D11=\"Ja\",F20=\"Nej\"),D20*IF(D8>261,(IF(F20=\"Ja\",260-'Format ark'!D13,260)),IF(D8<=260,IF(F20=\"Ja\",D8-'Format ark'!D13,D8))),0)+IF(AND(D11=\"Ja\",F21=\"Nej\"),D21*IF(D8>261,(IF(F21=\"Ja\",260-'Format ark'!D13,260)),IF(D8<=260,IF(F21=\"Ja\",D8-'Format ark'!D13,D8))),0)+IF(AND(D11=\"Ja\",F22=\"Nej\"),D22*IF(D8>261,(IF(F22=\"Ja\",260-'Format ark'!D13,260)),IF(D8<=260,IF(F22=\"Ja\",D8-'Format ark'!D13,D8))),0)","v":0}]
[null,"Estimeret VEU-godtgørelse",null,{"$f":"IF(AND(D11=\"Ja\",F18=\"Ja\"),D18*'Format ark'!D13,0)+IF(AND(D11=\"Ja\",F19=\"Ja\"),D19*'Format ark'!D13,0)+IF(AND(D11=\"Ja\",F20=\"Ja\"),D20*'Format ark'!D13,0)+IF(AND(D11=\"Ja\",F21=\"Ja\"),D21*'Format ark'!D13,0)+IF(AND(D11=\"Ja\",F22=\"Ja\"),D22*'Format ark'!D13,0)","v":0}]
[null,"Samlet deltagerbeltaing (udregner selv)",null,{"$f":"SUM(E18:E22)","v":0}]
[]
[null,"Erhversrettet efteruddannelse\nSkriv navn på efteruddannelse",null,"Medarbejderens timeforbrug (timer)","Evt. deltagerbetaling (kr.)","Giver kurset ret til VEU-godtgørelse?"]
[]
[]
[]
[]
[]
[]
[]
[]
[]
[]
[]
[null,"Kørsel/transport (angives som faktisk udgift)",null,null,null,"Nej"]
[null,"Samlet antal timer (udregner selv)",null,{"$f":"SUM(D29:D40)","v":0}]
[null,"Samlet lønkompensation udover evt. VEU-godtgørelse (udregner selv)",null,{"$f":"IF(D11=\"Nej\",D41*D7,0)+IF(AND(D11=\"Ja\",F29=\"Ja\"),D29*D7,0)+IF(AND(D11=\"Ja\",F30=\"Ja\"),D30*D7,0)+IF(AND(D11=\"Ja\",F31=\"Ja\"),D31*D7,0)+IF(AND(D11=\"Ja\",F32=\"Ja\"),D32*D7,0)+IF(AND(D11=\"Ja\",F33=\"Ja\"),D33*D7,0)+IF(AND(D11=\"Ja\",F34=\"Ja\"),D34*D7,0)+IF(AND(D11=\"Ja\",F35=\"Ja\"),D35*D7,0)+IF(AND(D11=\"Ja\",F36=\"Ja\"),D36*D7,0)+IF(AND(D11=\"Ja\",F37=\"Ja\"),D37*D7,0)+IF(AND(D11=\"Ja\",F38=\"Ja\"),D38*D7,0)+IF(AND(D11=\"Ja\",F39=\"Ja\"),D39*D7,0)+IF(AND(D11=\"Ja\",F40=\"Ja\"),D40*D7,0)+IF(AND(D11=\"Ja\",F29=\"Nej\"),D29* IF(D8>261,(IF(F29=\"Ja\",260-'Format ark'!D13,260)),IF(D8<=260,IF(F29=\"Ja\",D8-'Format ark'!D13,D8))),0)+IF(AND(D11=\"Ja\",F30=\"Nej\"),D30* IF(D8>261,(IF(F30=\"Ja\",260-'Format ark'!D13,260)),IF(D8<=260,IF(F30=\"Ja\",D8-'Format ark'!D13,D8))),0)+IF(AND(D11=\"Ja\",F31=\"Nej\"),D31* IF(D8>261,(IF(F31=\"Ja\",260-'Format ark'!D13,260)),IF(D8<=260,IF(F31=\"Ja\",D8-'Format ark'!D13,D8))),0)+IF(AND(D11=\"Ja\",F32=\"Nej\"),D32* IF(D8>261,(IF(F32=\"Ja\",260-'Format ark'!D13,260)),IF(D8<=260,IF(F32=\"Ja\",D8-'Format ark'!D13,D8))),0)+IF(AND(D11=\"Ja\",F33=\"Nej\"),D33* IF(D8>261,(IF(F33=\"Ja\",260-'Format ark'!D13,260)),IF(D8<=260,IF(F33=\"Ja\",D8-'Format ark'!D13,D8))),0)+IF(AND(D11=\"Ja\",F34=\"Nej\"),D34* IF(D8>261,(IF(F34=\"Ja\",260-'Format ark'!D13,260)),IF(D8<=260,IF(F34=\"Ja\",D8-'Format ark'!D13,D8))),0)+IF(AND(D11=\"Ja\",F35=\"Nej\"),D35* IF(D8>261,(IF(F35=\"Ja\",260-'Format ark'!D13,260)),IF(D8<=260,IF(F35=\"Ja\",D8-'Format ark'!D13,D8))),0)+IF(AND(D11=\"Ja\",F36=\"Nej\"),D36* IF(D8>261,(IF(F36=\"Ja\",260-'Format ark'!D13,260)),IF(D8<=260,IF(F36=\"Ja\",D8-'Format ark'!D13,D8))),0)+IF(AND(D11=\"Ja\",F37=\"Nej\"),D37* IF(D8>261,(IF(F37=\"Ja\",260-'Format ark'!D13,260)),IF(D8<=260,IF(F37=\"Ja\",D8-'Format ark'!D13,D8))),0)+IF(AND(D11=\"Ja\",F38=\"Nej\"),D38* IF(D8>261,(IF(F38=\"Ja\",260-'Format ark'!D13,260)),IF(D8<=260,IF(F38=\"Ja\",D8-'Format ark'!D13,D8))),0)+IF(AND(D11=\"Ja\",F39=\"Nej\"),D39* IF(D8>261,(IF(F39=\"Ja\",260-'Format ark'!D13,260)),IF(D8<=260,IF(F39=\"Ja\",D8-'Format ark'!D13,D8))),0)+IF(AND(D11=\"Ja\",F40=\"Nej\"),D40* IF(D8>261,(IF(F40=\"Ja\",260-'Format ark'!D13,260)),IF(D8<=260,IF(F40=\"Ja\",D8-'Format ark'!D13,D8))),0)","v":0}]
[null,"Estimeret VEU-godtgørelse",null,{"$f":"IF(AND(D11=\"Ja\",F29=\"Ja\"),D29*'Format ark'!D13,0)+IF(AND(D11=\"Ja\",F30=\"Ja\"),D30*'Format ark'!D13,0)+IF(AND(D11=\"Ja\",F31=\"Ja\"),D31*'Format ark'!D13,0)+IF(AND(D11=\"Ja\",F32=\"Ja\"),D32*('Format ark'!D13),0)+IF(AND(D11=\"Ja\",F33=\"Ja\"),D33*'Format ark'!D13,0)+IF(AND(D11=\"Ja\",F34=\"Ja\"),D34*'Format ark'!D13,0)+IF(AND(D11=\"Ja\",F35=\"Ja\"),D35*'Format ark'!D13,0)+IF(AND(D11=\"Ja\",F36=\"Ja\"),D36*'Format ark'!D13,0)+IF(AND(D11=\"Ja\",F37=\"Ja\"),D37*'Format ark'!D13,0)+IF(AND(D11=\"Ja\",F38=\"Ja\"),D38*'Format ark'!D13,0)+IF(AND(D11=\"Ja\",F39=\"Ja\"),D39*'Format ark'!D13,0)+IF(AND(D11=\"Ja\",F40=\"Ja\"),D40*'Format ark'!D13,0)","v":0}]
[null,"Samlet deltagerbetaling (udregner selv)",null,{"$f":"SUM(E29:E40)","v":0}]
[]
[null,"Praktik"]
[null,"Navn på virksomhed og p-nummer"]
[null,"Medarbejderens timeforbrug",null,null,{"$f":"IF(D48>C51*0.5,\"Praktik må maksimalt udgøre 50% af det samlede tidsforbrug.\",\" \")","v":" "}]
[null,"Samlet lønkompensation for praktikopholdet",null,{"$f":"IF(D48>C51*0.5,\"IKKE MULIGT\",D48*(IF(D8>261,260,D8)))","v":0}]
[]
[null,"Samlet tidsforbrug ",{"$f":"IF(D48+D41+D23>300,\"IKKE MULIGT\",D48+D41+D23)","v":0},{"$f":"IF(C51>300,\"Det maksimale tidsforbrug er 300 timer\",\" \")","v":" "}]
[]
[null,"Tidsforbrug til administration","Antal timer","Beløb"]
[null,"Der kan godtgøres op til 5 timer.",null,{"$f":"IF(C54>5,\"Der kan maksimalt godtgøres 5 timer pr. medarbejder.\",C54*260)","v":0}]
[]
[null,"Samlet tilsagnsramme i kr. (maksimal støtte til sporskiftepakken): ",null,{"$f":"IF(C51>300,0,MIN(D49+D44+D42+D26+D24+D54,120000))","v":0},{"$f":"IF(D56=120000,\"Det maksimale tilsagn pr. sporskiftepakke er nået, og det overstigende beløb er derfor selvbetaling.\",\"\")","v":""}]
[]
[]
[null,"Estimeret VEU-godtgørelse",null,{"$f":"D43+D25","v":0}]
[]
[null,"Selvbetaling i kr. (udgifter udover den øvre tilsagnsramme)",null,{"$f":"IF(C51>300,0,IF(D56=120000,D44+D26+D42+D49+D24+D54-120000,0))","v":0}]

{"sheet":"Medarbejder 20","index":20,"n_rows":61,"n_cols":6,"rows_kept":61,"cut":false,"hidden":true,"merged":[[6,1,6,2],[8,1,8,2],[7,1,7,2],[55,1,56,2],[8,4,8,5],[21,1,21,2],[9,1,9,2],[9,4,9,5],[10,1,10,2],[11,1,11,3],[12,1,12,3],[17,1,17,2],[18,1,18,2],[19,1,19,2],[20,1,20,2],[55,3,56,3],[16,1,16,2],[33,1,33,2],[34,1,34,2],[27,1,27,2],[28,1,28,2],[29,1,29,2],[30,1,30,2],[31,1,31,2],[32,1,32,2],[35,1,35,2],[36,1,36,2],[37,1,37,2],[38,1,38,2],[39,1,39,2]]}
[{"$f":"Vejledning!P21","v":0}]
[null,null,"Budget/Regnskab for sporskiftepakken"]
[]
[null,null,"Oplysninger om medarbejderen"]
[]
[null,null,"Medarbejder 20"]
[null,"Medarbejderens lønkompensation fra sporskifte (kr./t.)",null,{"$f":"IF(D8>261,(IF(D11=\"Ja\",260-'Format ark'!D13,260)),IF(D8<=260,IF(D11=\"Ja\",IF(D8<'Format ark'!D13,0,D8-'Format ark'!D13),D8)))","v":0}]
[null,"Medarbejderens timesats (kr./t.)"]
[null,"Medarbejderens højst gennemførte uddannelse",null,null,{"$f":"IF(D9=\"\",\"Husk at vælge medarbejderens højst gennemførte uddannelse.\",\" \")","v":"Husk at vælge medarbejderens højst gennemførte uddannelse."}]
[null,"Har medarbejderen brugt sin uddannelse de senest 5 år?",null,null,{"$f":"IF(D10=\"\",\"Husk at svare på spørgsmålet.\",\" \")","v":"Husk at svare på spørgsmålet."}]
[null,"Medarbejder formodes at være berettiget til at få VEU-godtgørelse ",null,{"$f":"IF(OR(D9=\"Videregående uddannelse\",D9=\"Gymnasial uddannelse\")*AND(D10=\"ja\"),\"Nej\",\"Ja\")","v":"Ja"}]
[null,"Beskriv herunder hvad formålet med den planlagte sporskiftepakke er for medarbejderen:"]
[]
[]
[null,null,"Aktiviteter"]
[]
[null,"Afklaring, vejledning mv. \nSkriv navn på kursus",null,"Medarbejderens timeforbug (timer)","Evt. deltagerbetaling (kr.)","Giver kurset ret til VEU-godtgørelse?"]
[]
[]
[]
[]
[]
[null,"Samlet antal timer (udregner selv)",null,{"$f":"SUM(D18:D22)","v":0}]
[null,"Samlet lønkompensation udover evt. VEU-godtgørelse (udregner selv)",null,{"$f":"IF(D11=\"Nej\",D23*D7,0)+IF(AND(D11=\"Ja\",F18=\"Ja\"),D18*D7,0)+IF(AND(D11=\"Ja\",F19=\"Ja\"),D19*D7,0)+IF(AND(D11=\"Ja\",F20=\"Ja\"),D20*D7,0)+IF(AND(D11=\"Ja\",F21=\"Ja\"),D21*D7,0)+IF(AND(D11=\"Ja\",F22=\"Ja\"),D22*D7,0)+IF(AND(D11=\"Ja\",F18=\"Nej\"),D18*IF(D8>261,(IF(F18=\"Ja\",260-'Format ark'!D13,260)),IF(D8<=260,IF(F18=\"Ja\",D8-'Format ark'!D13,D8))),0)+IF(AND(D11=\"Ja\",F19=\"Nej\"),D19*IF(D8>261,(IF(F19=\"Ja\",260-'Format ark'!D13,260)),IF(D8<=260,IF(F19=\"Ja\",D8-'Format ark'!D13,D8))),0)+IF(AND(D11=\"Ja\",F20=\"Nej\"),D20*IF(D8>261,(IF(F20=\"Ja\",260-'Format ark'!D13,260)),IF(D8<=260,IF(F20=\"Ja\",D8-'Format ark'!D13,D8))),0)+IF(AND(D11=\"Ja\",F21=\"Nej\"),D21*IF(D8>261,(IF(F21=\"Ja\",260-'Format ark'!D13,260)),IF(D8<=260,IF(F21=\"Ja\",D8-'Format ark'!D13,D8))),0)+IF(AND(D11=\"Ja\",F22=\"Nej\"),D22*IF(D8>261,(IF(F22=\"Ja\",260-'Format ark'!D13,260)),IF(D8<=260,IF(F22=\"Ja\",D8-'Format ark'!D13,D8))),0)","v":0}]
[null,"Estimeret VEU-godtgørelse",null,{"$f":"IF(AND(D11=\"Ja\",F18=\"Ja\"),D18*'Format ark'!D13,0)+IF(AND(D11=\"Ja\",F19=\"Ja\"),D19*'Format ark'!D13,0)+IF(AND(D11=\"Ja\",F20=\"Ja\"),D20*'Format ark'!D13,0)+IF(AND(D11=\"Ja\",F21=\"Ja\"),D21*'Format ark'!D13,0)+IF(AND(D11=\"Ja\",F22=\"Ja\"),D22*'Format ark'!D13,0)","v":0}]
[null,"Samlet deltagerbeltaing (udregner selv)",null,{"$f":"SUM(E18:E22)","v":0}]
[]
[null,"Erhversrettet efteruddannelse\nSkriv navn på efteruddannelse",null,"Medarbejderens timeforbrug (timer)","Evt. deltagerbetaling (kr.)","Giver kurset ret til VEU-godtgørelse?"]
[]
[]
[]
[]
[]
[]
[]
[]
[]
[]
[]
[null,"Kørsel/transport (angives som faktisk udgift)",null,null,null,"Nej"]
[null,"Samlet antal timer (udregner selv)",null,{"$f":"SUM(D29:D40)","v":0}]
[null,"Samlet lønkompensation udover evt. VEU-godtgørelse (udregner selv)",null,{"$f":"IF(D11=\"Nej\",D41*D7,0)+IF(AND(D11=\"Ja\",F29=\"Ja\"),D29*D7,0)+IF(AND(D11=\"Ja\",F30=\"Ja\"),D30*D7,0)+IF(AND(D11=\"Ja\",F31=\"Ja\"),D31*D7,0)+IF(AND(D11=\"Ja\",F32=\"Ja\"),D32*D7,0)+IF(AND(D11=\"Ja\",F33=\"Ja\"),D33*D7,0)+IF(AND(D11=\"Ja\",F34=\"Ja\"),D34*D7,0)+IF(AND(D11=\"Ja\",F35=\"Ja\"),D35*D7,0)+IF(AND(D11=\"Ja\",F36=\"Ja\"),D36*D7,0)+IF(AND(D11=\"Ja\",F37=\"Ja\"),D37*D7,0)+IF(AND(D11=\"Ja\",F38=\"Ja\"),D38*D7,0)+IF(AND(D11=\"Ja\",F39=\"Ja\"),D39*D7,0)+IF(AND(D11=\"Ja\",F40=\"Ja\"),D40*D7,0)+IF(AND(D11=\"Ja\",F29=\"Nej\"),D29* IF(D8>261,(IF(F29=\"Ja\",260-'Format ark'!D13,260)),IF(D8<=260,IF(F29=\"Ja\",D8-'Format ark'!D13,D8))),0)+IF(AND(D11=\"Ja\",F30=\"Nej\"),D30* IF(D8>261,(IF(F30=\"Ja\",260-'Format ark'!D13,260)),IF(D8<=260,IF(F30=\"Ja\",D8-'Format ark'!D13,D8))),0)+IF(AND(D11=\"Ja\",F31=\"Nej\"),D31* IF(D8>261,(IF(F31=\"Ja\",260-'Format ark'!D13,260)),IF(D8<=260,IF(F31=\"Ja\",D8-'Format ark'!D13,D8))),0)+IF(AND(D11=\"Ja\",F32=\"Nej\"),D32* IF(D8>261,(IF(F32=\"Ja\",260-'Format ark'!D13,260)),IF(D8<=260,IF(F32=\"Ja\",D8-'Format ark'!D13,D8))),0)+IF(AND(D11=\"Ja\",F33=\"Nej\"),D33* IF(D8>261,(IF(F33=\"Ja\",260-'Format ark'!D13,260)),IF(D8<=260,IF(F33=\"Ja\",D8-'Format ark'!D13,D8))),0)+IF(AND(D11=\"Ja\",F34=\"Nej\"),D34* IF(D8>261,(IF(F34=\"Ja\",260-'Format ark'!D13,260)),IF(D8<=260,IF(F34=\"Ja\",D8-'Format ark'!D13,D8))),0)+IF(AND(D11=\"Ja\",F35=\"Nej\"),D35* IF(D8>261,(IF(F35=\"Ja\",260-'Format ark'!D13,260)),IF(D8<=260,IF(F35=\"Ja\",D8-'Format ark'!D13,D8))),0)+IF(AND(D11=\"Ja\",F36=\"Nej\"),D36* IF(D8>261,(IF(F36=\"Ja\",260-'Format ark'!D13,260)),IF(D8<=260,IF(F36=\"Ja\",D8-'Format ark'!D13,D8))),0)+IF(AND(D11=\"Ja\",F37=\"Nej\"),D37* IF(D8>261,(IF(F37=\"Ja\",260-'Format ark'!D13,260)),IF(D8<=260,IF(F37=\"Ja\",D8-'Format ark'!D13,D8))),0)+IF(AND(D11=\"Ja\",F38=\"Nej\"),D38* IF(D8>261,(IF(F38=\"Ja\",260-'Format ark'!D13,260)),IF(D8<=260,IF(F38=\"Ja\",D8-'Format ark'!D13,D8))),0)+IF(AND(D11=\"Ja\",F39=\"Nej\"),D39* IF(D8>261,(IF(F39=\"Ja\",260-'Format ark'!D13,260)),IF(D8<=260,IF(F39=\"Ja\",D8-'Format ark'!D13,D8))),0)+IF(AND(D11=\"Ja\",F40=\"Nej\"),D40* IF(D8>261,(IF(F40=\"Ja\",260-'Format ark'!D13,260)),IF(D8<=260,IF(F40=\"Ja\",D8-'Format ark'!D13,D8))),0)","v":0}]
[null,"Estimeret VEU-godtgørelse",null,{"$f":"IF(AND(D11=\"Ja\",F29=\"Ja\"),D29*'Format ark'!D13,0)+IF(AND(D11=\"Ja\",F30=\"Ja\"),D30*'Format ark'!D13,0)+IF(AND(D11=\"Ja\",F31=\"Ja\"),D31*'Format ark'!D13,0)+IF(AND(D11=\"Ja\",F32=\"Ja\"),D32*('Format ark'!D13),0)+IF(AND(D11=\"Ja\",F33=\"Ja\"),D33*'Format ark'!D13,0)+IF(AND(D11=\"Ja\",F34=\"Ja\"),D34*'Format ark'!D13,0)+IF(AND(D11=\"Ja\",F35=\"Ja\"),D35*'Format ark'!D13,0)+IF(AND(D11=\"Ja\",F36=\"Ja\"),D36*'Format ark'!D13,0)+IF(AND(D11=\"Ja\",F37=\"Ja\"),D37*'Format ark'!D13,0)+IF(AND(D11=\"Ja\",F38=\"Ja\"),D38*'Format ark'!D13,0)+IF(AND(D11=\"Ja\",F39=\"Ja\"),D39*'Format ark'!D13,0)+IF(AND(D11=\"Ja\",F40=\"Ja\"),D40*'Format ark'!D13,0)","v":0}]
[null,"Samlet deltagerbetaling (udregner selv)",null,{"$f":"SUM(E29:E40)","v":0}]
[]
[null,"Praktik"]
[null,"Navn på virksomhed og p-nummer"]
[null,"Medarbejderens timeforbrug",null,null,{"$f":"IF(D48>C51*0.5,\"Praktik må maksimalt udgøre 50% af det samlede tidsforbrug.\",\" \")","v":" "}]
[null,"Samlet lønkompensation for praktikopholdet",null,{"$f":"IF(D48>C51*0.5,\"IKKE MULIGT\",D48*(IF(D8>261,260,D8)))","v":0}]
[]
[null,"Samlet tidsforbrug ",{"$f":"IF(D48+D41+D23>300,\"IKKE MULIGT\",D48+D41+D23)","v":0},{"$f":"IF(C51>300,\"Det maksimale tidsforbrug er 300 timer\",\" \")","v":" "}]
[]
[null,"Tidsforbrug til administration","Antal timer","Beløb"]
[null,"Der kan godtgøres op til 5 timer.",null,{"$f":"IF(C54>5,\"Der kan maksimalt godtgøres 5 timer pr. medarbejder.\",C54*260)","v":0}]
[]
[null,"Samlet tilsagnsramme i kr. (maksimal støtte til sporskiftepakken): ",null,{"$f":"IF(C51>300,0,MIN(D49+D44+D42+D26+D24+D54,120000))","v":0},{"$f":"IF(D56=120000,\"Det maksimale tilsagn pr. sporskiftepakke er nået, og det overstigende beløb er derfor selvbetaling.\",\"\")","v":""}]
[]
[]
[null,"Estimeret VEU-godtgørelse",null,{"$f":"D43+D25","v":0}]
[]
[null,"Selvbetaling i kr. (udgifter udover den øvre tilsagnsramme)",null,{"$f":"IF(C51>300,0,IF(D56=120000,D44+D26+D42+D49+D24+D54-120000,0))","v":0}]

{"sheet":"Medarbejder 21","index":21,"n_rows":61,"n_cols":6,"rows_kept":61,"cut":false,"hidden":true,"merged":[[6,1,6,2],[8,1,8,2],[7,1,7,2],[55,1,56,2],[8,4,8,5],[21,1,21,2],[9,1,9,2],[9,4,9,5],[10,1,10,2],[11,1,11,3],[12,1,12,3],[17,1,17,2],[18,1,18,2],[19,1,19,2],[20,1,20,2],[55,3,56,3],[16,1,16,2],[33,1,33,2],[34,1,34,2],[27,1,27,2],[28,1,28,2],[29,1,29,2],[30,1,30,2],[31,1,31,2],[32,1,32,2],[35,1,35,2],[36,1,36,2],[37,1,37,2],[38,1,38,2],[39,1,39,2]]}
[]
[null,null,"Budget/Regnskab for sporskiftepakken"]
[]
[null,null,"Oplysninger om medarbejderen"]
[]
[null,null,"Medarbejder 21"]
[null,"Medarbejderens lønkompensation fra sporskifte (kr./t.)",null,{"$f":"IF(D8>261,(IF(D11=\"Ja\",260-'Format ark'!D13,260)),IF(D8<=260,IF(D11=\"Ja\",IF(D8<'Format ark'!D13,0,D8-'Format ark'!D13),D8)))","v":0}]
[null,"Medarbejderens timesats (kr./t.)"]
[null,"Medarbejderens højst gennemførte uddannelse",null,null,{"$f":"IF(D9=\"\",\"Husk at vælge medarbejderens højst gennemførte uddannelse.\",\" \")","v":"Husk at vælge medarbejderens højst gennemførte uddannelse."}]
[null,"Har medarbejderen brugt sin uddannelse de senest 5 år?",null,null,{"$f":"IF(D10=\"\",\"Husk at svare på spørgsmålet.\",\" \")","v":"Husk at svare på spørgsmålet."}]
[null,"Medarbejder formodes at være berettiget til at få VEU-godtgørelse ",null,{"$f":"IF(OR(D9=\"Videregående uddannelse\",D9=\"Gymnasial uddannelse\")*AND(D10=\"ja\"),\"Nej\",\"Ja\")","v":"Ja"}]
[null,"Beskriv herunder hvad formålet med den planlagte sporskiftepakke er for medarbejderen:"]
[]
[]
[null,null,"Aktiviteter"]
[]
[null,"Afklaring, vejledning mv. \nSkriv navn på kursus",null,"Medarbejderens timeforbug (timer)","Evt. deltagerbetaling (kr.)","Giver kurset ret til VEU-godtgørelse?"]
[]
[]
[]
[]
[]
[null,"Samlet antal timer (udregner selv)",null,{"$f":"SUM(D18:D22)","v":0}]
[null,"Samlet lønkompensation udover evt. VEU-godtgørelse (udregner selv)",null,{"$f":"IF(D11=\"Nej\",D23*D7,0)+IF(AND(D11=\"Ja\",F18=\"Ja\"),D18*D7,0)+IF(AND(D11=\"Ja\",F19=\"Ja\"),D19*D7,0)+IF(AND(D11=\"Ja\",F20=\"Ja\"),D20*D7,0)+IF(AND(D11=\"Ja\",F21=\"Ja\"),D21*D7,0)+IF(AND(D11=\"Ja\",F22=\"Ja\"),D22*D7,0)+IF(AND(D11=\"Ja\",F18=\"Nej\"),D18*IF(D8>261,(IF(F18=\"Ja\",260-'Format ark'!D13,260)),IF(D8<=260,IF(F18=\"Ja\",D8-'Format ark'!D13,D8))),0)+IF(AND(D11=\"Ja\",F19=\"Nej\"),D19*IF(D8>261,(IF(F19=\"Ja\",260-'Format ark'!D13,260)),IF(D8<=260,IF(F19=\"Ja\",D8-'Format ark'!D13,D8))),0)+IF(AND(D11=\"Ja\",F20=\"Nej\"),D20*IF(D8>261,(IF(F20=\"Ja\",260-'Format ark'!D13,260)),IF(D8<=260,IF(F20=\"Ja\",D8-'Format ark'!D13,D8))),0)+IF(AND(D11=\"Ja\",F21=\"Nej\"),D21*IF(D8>261,(IF(F21=\"Ja\",260-'Format ark'!D13,260)),IF(D8<=260,IF(F21=\"Ja\",D8-'Format ark'!D13,D8))),0)+IF(AND(D11=\"Ja\",F22=\"Nej\"),D22*IF(D8>261,(IF(F22=\"Ja\",260-'Format ark'!D13,260)),IF(D8<=260,IF(F22=\"Ja\",D8-'Format ark'!D13,D8))),0)","v":0}]
[null,"Estimeret VEU-godtgørelse",null,{"$f":"IF(AND(D11=\"Ja\",F18=\"Ja\"),D18*'Format ark'!D13,0)+IF(AND(D11=\"Ja\",F19=\"Ja\"),D19*'Format ark'!D13,0)+IF(AND(D11=\"Ja\",F20=\"Ja\"),D20*'Format ark'!D13,0)+IF(AND(D11=\"Ja\",F21=\"Ja\"),D21*'Format ark'!D13,0)+IF(AND(D11=\"Ja\",F22=\"Ja\"),D22*'Format ark'!D13,0)","v":0}]
[null,"Samlet deltagerbeltaing (udregner selv)",null,{"$f":"SUM(E18:E22)","v":0}]
[]
[null,"Erhversrettet efteruddannelse\nSkriv navn på efteruddannelse",null,"Medarbejderens timeforbrug (timer)","Evt. deltagerbetaling (kr.)","Giver kurset ret til VEU-godtgørelse?"]
[]
[]
[]
[]
[]
[]
[]
[]
[]
[]
[]
[null,"Kørsel/transport (angives som faktisk udgift)",null,null,null,"Nej"]
[null,"Samlet antal timer (udregner selv)",null,{"$f":"SUM(D29:D40)","v":0}]
[null,"Samlet lønkompensation udover evt. VEU-godtgørelse (udregner selv)",null,{"$f":"IF(D11=\"Nej\",D41*D7,0)+IF(AND(D11=\"Ja\",F29=\"Ja\"),D29*D7,0)+IF(AND(D11=\"Ja\",F30=\"Ja\"),D30*D7,0)+IF(AND(D11=\"Ja\",F31=\"Ja\"),D31*D7,0)+IF(AND(D11=\"Ja\",F32=\"Ja\"),D32*D7,0)+IF(AND(D11=\"Ja\",F33=\"Ja\"),D33*D7,0)+IF(AND(D11=\"Ja\",F34=\"Ja\"),D34*D7,0)+IF(AND(D11=\"Ja\",F35=\"Ja\"),D35*D7,0)+IF(AND(D11=\"Ja\",F36=\"Ja\"),D36*D7,0)+IF(AND(D11=\"Ja\",F37=\"Ja\"),D37*D7,0)+IF(AND(D11=\"Ja\",F38=\"Ja\"),D38*D7,0)+IF(AND(D11=\"Ja\",F39=\"Ja\"),D39*D7,0)+IF(AND(D11=\"Ja\",F40=\"Ja\"),D40*D7,0)+IF(AND(D11=\"Ja\",F29=\"Nej\"),D29* IF(D8>261,(IF(F29=\"Ja\",260-'Format ark'!D13,260)),IF(D8<=260,IF(F29=\"Ja\",D8-'Format ark'!D13,D8))),0)+IF(AND(D11=\"Ja\",F30=\"Nej\"),D30* IF(D8>261,(IF(F30=\"Ja\",260-'Format ark'!D13,260)),IF(D8<=260,IF(F30=\"Ja\",D8-'Format ark'!D13,D8))),0)+IF(AND(D11=\"Ja\",F31=\"Nej\"),D31* IF(D8>261,(IF(F31=\"Ja\",260-'Format ark'!D13,260)),IF(D8<=260,IF(F31=\"Ja\",D8-'Format ark'!D13,D8))),0)+IF(AND(D11=\"Ja\",F32=\"Nej\"),D32* IF(D8>261,(IF(F32=\"Ja\",260-'Format ark'!D13,260)),IF(D8<=260,IF(F32=\"Ja\",D8-'Format ark'!D13,D8))),0)+IF(AND(D11=\"Ja\",F33=\"Nej\"),D33* IF(D8>261,(IF(F33=\"Ja\",260-'Format ark'!D13,260)),IF(D8<=260,IF(F33=\"Ja\",D8-'Format ark'!D13,D8))),0)+IF(AND(D11=\"Ja\",F34=\"Nej\"),D34* IF(D8>261,(IF(F34=\"Ja\",260-'Format ark'!D13,260)),IF(D8<=260,IF(F34=\"Ja\",D8-'Format ark'!D13,D8))),0)+IF(AND(D11=\"Ja\",F35=\"Nej\"),D35* IF(D8>261,(IF(F35=\"Ja\",260-'Format ark'!D13,260)),IF(D8<=260,IF(F35=\"Ja\",D8-'Format ark'!D13,D8))),0)+IF(AND(D11=\"Ja\",F36=\"Nej\"),D36* IF(D8>261,(IF(F36=\"Ja\",260-'Format ark'!D13,260)),IF(D8<=260,IF(F36=\"Ja\",D8-'Format ark'!D13,D8))),0)+IF(AND(D11=\"Ja\",F37=\"Nej\"),D37* IF(D8>261,(IF(F37=\"Ja\",260-'Format ark'!D13,260)),IF(D8<=260,IF(F37=\"Ja\",D8-'Format ark'!D13,D8))),0)+IF(AND(D11=\"Ja\",F38=\"Nej\"),D38* IF(D8>261,(IF(F38=\"Ja\",260-'Format ark'!D13,260)),IF(D8<=260,IF(F38=\"Ja\",D8-'Format ark'!D13,D8))),0)+IF(AND(D11=\"Ja\",F39=\"Nej\"),D39* IF(D8>261,(IF(F39=\"Ja\",260-'Format ark'!D13,260)),IF(D8<=260,IF(F39=\"Ja\",D8-'Format ark'!D13,D8))),0)+IF(AND(D11=\"Ja\",F40=\"Nej\"),D40* IF(D8>261,(IF(F40=\"Ja\",260-'Format ark'!D13,260)),IF(D8<=260,IF(F40=\"Ja\",D8-'Format ark'!D13,D8))),0)","v":0}]
[null,"Estimeret VEU-godtgørelse",null,{"$f":"IF(AND(D11=\"Ja\",F29=\"Ja\"),D29*'Format ark'!D13,0)+IF(AND(D11=\"Ja\",F30=\"Ja\"),D30*'Format ark'!D13,0)+IF(AND(D11=\"Ja\",F31=\"Ja\"),D31*'Format ark'!D13,0)+IF(AND(D11=\"Ja\",F32=\"Ja\"),D32*('Format ark'!D13),0)+IF(AND(D11=\"Ja\",F33=\"Ja\"),D33*'Format ark'!D13,0)+IF(AND(D11=\"Ja\",F34=\"Ja\"),D34*'Format ark'!D13,0)+IF(AND(D11=\"Ja\",F35=\"Ja\"),D35*'Format ark'!D13,0)+IF(AND(D11=\"Ja\",F36=\"Ja\"),D36*'Format ark'!D13,0)+IF(AND(D11=\"Ja\",F37=\"Ja\"),D37*'Format ark'!D13,0)+IF(AND(D11=\"Ja\",F38=\"Ja\"),D38*'Format ark'!D13,0)+IF(AND(D11=\"Ja\",F39=\"Ja\"),D39*'Format ark'!D13,0)+IF(AND(D11=\"Ja\",F40=\"Ja\"),D40*'Format ark'!D13,0)","v":0}]
[null,"Samlet deltagerbetaling (udregner selv)",null,{"$f":"SUM(E29:E40)","v":0}]
[]
[null,"Praktik"]
[null,"Navn på virksomhed og p-nummer"]
[null,"Medarbejderens timeforbrug",null,null,{"$f":"IF(D48>C51*0.5,\"Praktik må maksimalt udgøre 50% af det samlede tidsforbrug.\",\" \")","v":" "}]
[null,"Samlet lønkompensation for praktikopholdet",null,{"$f":"IF(D48>C51*0.5,\"IKKE MULIGT\",D48*(IF(D8>261,260,D8)))","v":0}]
[]
[null,"Samlet tidsforbrug ",{"$f":"IF(D48+D41+D23>300,\"IKKE MULIGT\",D48+D41+D23)","v":0},{"$f":"IF(C51>300,\"Det maksimale tidsforbrug er 300 timer\",\" \")","v":" "}]
[]
[null,"Tidsforbrug til administration","Antal timer","Beløb"]
[null,"Der kan godtgøres op til 5 timer.",null,{"$f":"IF(C54>5,\"Der kan maksimalt godtgøres 5 timer pr. medarbejder.\",C54*260)","v":0}]
[]
[null,"Samlet tilsagnsramme i kr. (maksimal støtte til sporskiftepakken): ",null,{"$f":"IF(C51>300,0,MIN(D49+D44+D42+D26+D24+D54,120000))","v":0},{"$f":"IF(D56=120000,\"Det maksimale tilsagn pr. sporskiftepakke er nået, og det overstigende beløb er derfor selvbetaling.\",\"\")","v":""}]
[]
[]
[null,"Estimeret VEU-godtgørelse",null,{"$f":"D43+D25","v":0}]
[]
[null,"Selvbetaling i kr. (udgifter udover den øvre tilsagnsramme)",null,{"$f":"IF(C51>300,0,IF(D56=120000,D44+D26+D42+D49+D24+D54-120000,0))","v":0}]

{"sheet":"Medarbejder 22","index":22,"n_rows":61,"n_cols":6,"rows_kept":61,"cut":false,"hidden":true,"merged":[[6,1,6,2],[8,1,8,2],[7,1,7,2],[55,1,56,2],[8,4,8,5],[21,1,21,2],[9,1,9,2],[9,4,9,5],[10,1,10,2],[11,1,11,3],[12,1,12,3],[17,1,17,2],[18,1,18,2],[19,1,19,2],[20,1,20,2],[55,3,56,3],[16,1,16,2],[33,1,33,2],[34,1,34,2],[27,1,27,2],[28,1,28,2],[29,1,29,2],[30,1,30,2],[31,1,31,2],[32,1,32,2],[35,1,35,2],[36,1,36,2],[37,1,37,2],[38,1,38,2],[39,1,39,2]]}
[]
[null,null,"Budget/Regnskab for sporskiftepakken"]
[]
[null,null,"Oplysninger om medarbejderen"]
[]
[null,null,"Medarbejder 22"]
[null,"Medarbejderens lønkompensation fra sporskifte (kr./t.)",null,{"$f":"IF(D8>261,(IF(D11=\"Ja\",260-'Format ark'!D13,260)),IF(D8<=260,IF(D11=\"Ja\",IF(D8<'Format ark'!D13,0,D8-'Format ark'!D13),D8)))","v":0}]
[null,"Medarbejderens timesats (kr./t.)"]
[null,"Medarbejderens højst gennemførte uddannelse",null,null,{"$f":"IF(D9=\"\",\"Husk at vælge medarbejderens højst gennemførte uddannelse.\",\" \")","v":"Husk at vælge medarbejderens højst gennemførte uddannelse."}]
[null,"Har medarbejderen brugt sin uddannelse de senest 5 år?",null,null,{"$f":"IF(D10=\"\",\"Husk at svare på spørgsmålet.\",\" \")","v":"Husk at svare på spørgsmålet."}]
[null,"Medarbejder formodes at være berettiget til at få VEU-godtgørelse ",null,{"$f":"IF(OR(D9=\"Videregående uddannelse\",D9=\"Gymnasial uddannelse\")*AND(D10=\"ja\"),\"Nej\",\"Ja\")","v":"Ja"}]
[null,"Beskriv herunder hvad formålet med den planlagte sporskiftepakke er for medarbejderen:"]
[]
[]
[null,null,"Aktiviteter"]
[]
[null,"Afklaring, vejledning mv. \nSkriv navn på kursus",null,"Medarbejderens timeforbug (timer)","Evt. deltagerbetaling (kr.)","Giver kurset ret til VEU-godtgørelse?"]
[]
[]
[]
[]
[]
[null,"Samlet antal timer (udregner selv)",null,{"$f":"SUM(D18:D22)","v":0}]
[null,"Samlet lønkompensation udover evt. VEU-godtgørelse (udregner selv)",null,{"$f":"IF(D11=\"Nej\",D23*D7,0)+IF(AND(D11=\"Ja\",F18=\"Ja\"),D18*D7,0)+IF(AND(D11=\"Ja\",F19=\"Ja\"),D19*D7,0)+IF(AND(D11=\"Ja\",F20=\"Ja\"),D20*D7,0)+IF(AND(D11=\"Ja\",F21=\"Ja\"),D21*D7,0)+IF(AND(D11=\"Ja\",F22=\"Ja\"),D22*D7,0)+IF(AND(D11=\"Ja\",F18=\"Nej\"),D18*IF(D8>261,(IF(F18=\"Ja\",260-'Format ark'!D13,260)),IF(D8<=260,IF(F18=\"Ja\",D8-'Format ark'!D13,D8))),0)+IF(AND(D11=\"Ja\",F19=\"Nej\"),D19*IF(D8>261,(IF(F19=\"Ja\",260-'Format ark'!D13,260)),IF(D8<=260,IF(F19=\"Ja\",D8-'Format ark'!D13,D8))),0)+IF(AND(D11=\"Ja\",F20=\"Nej\"),D20*IF(D8>261,(IF(F20=\"Ja\",260-'Format ark'!D13,260)),IF(D8<=260,IF(F20=\"Ja\",D8-'Format ark'!D13,D8))),0)+IF(AND(D11=\"Ja\",F21=\"Nej\"),D21*IF(D8>261,(IF(F21=\"Ja\",260-'Format ark'!D13,260)),IF(D8<=260,IF(F21=\"Ja\",D8-'Format ark'!D13,D8))),0)+IF(AND(D11=\"Ja\",F22=\"Nej\"),D22*IF(D8>261,(IF(F22=\"Ja\",260-'Format ark'!D13,260)),IF(D8<=260,IF(F22=\"Ja\",D8-'Format ark'!D13,D8))),0)","v":0}]
[null,"Estimeret VEU-godtgørelse",null,{"$f":"IF(AND(D11=\"Ja\",F18=\"Ja\"),D18*'Format ark'!D13,0)+IF(AND(D11=\"Ja\",F19=\"Ja\"),D19*'Format ark'!D13,0)+IF(AND(D11=\"Ja\",F20=\"Ja\"),D20*'Format ark'!D13,0)+IF(AND(D11=\"Ja\",F21=\"Ja\"),D21*'Format ark'!D13,0)+IF(AND(D11=\"Ja\",F22=\"Ja\"),D22*'Format ark'!D13,0)","v":0}]
[null,"Samlet deltagerbeltaing (udregner selv)",null,{"$f":"SUM(E18:E22)","v":0}]
[]
[null,"Erhversrettet efteruddannelse\nSkriv navn på efteruddannelse",null,"Medarbejderens timeforbrug (timer)","Evt. deltagerbetaling (kr.)","Giver kurset ret til VEU-godtgørelse?"]
[]
[]
[]
[]
[]
[]
[]
[]
[]
[]
[]
[null,"Kørsel/transport (angives som faktisk udgift)",null,null,null,"Nej"]
[null,"Samlet antal timer (udregner selv)",null,{"$f":"SUM(D29:D40)","v":0}]
[null,"Samlet lønkompensation udover evt. VEU-godtgørelse (udregner selv)",null,{"$f":"IF(D11=\"Nej\",D41*D7,0)+IF(AND(D11=\"Ja\",F29=\"Ja\"),D29*D7,0)+IF(AND(D11=\"Ja\",F30=\"Ja\"),D30*D7,0)+IF(AND(D11=\"Ja\",F31=\"Ja\"),D31*D7,0)+IF(AND(D11=\"Ja\",F32=\"Ja\"),D32*D7,0)+IF(AND(D11=\"Ja\",F33=\"Ja\"),D33*D7,0)+IF(AND(D11=\"Ja\",F34=\"Ja\"),D34*D7,0)+IF(AND(D11=\"Ja\",F35=\"Ja\"),D35*D7,0)+IF(AND(D11=\"Ja\",F36=\"Ja\"),D36*D7,0)+IF(AND(D11=\"Ja\",F37=\"Ja\"),D37*D7,0)+IF(AND(D11=\"Ja\",F38=\"Ja\"),D38*D7,0)+IF(AND(D11=\"Ja\",F39=\"Ja\"),D39*D7,0)+IF(AND(D11=\"Ja\",F40=\"Ja\"),D40*D7,0)+IF(AND(D11=\"Ja\",F29=\"Nej\"),D29* IF(D8>261,(IF(F29=\"Ja\",260-'Format ark'!D13,260)),IF(D8<=260,IF(F29=\"Ja\",D8-'Format ark'!D13,D8))),0)+IF(AND(D11=\"Ja\",F30=\"Nej\"),D30* IF(D8>261,(IF(F30=\"Ja\",260-'Format ark'!D13,260)),IF(D8<=260,IF(F30=\"Ja\",D8-'Format ark'!D13,D8))),0)+IF(AND(D11=\"Ja\",F31=\"Nej\"),D31* IF(D8>261,(IF(F31=\"Ja\",260-'Format ark'!D13,260)),IF(D8<=260,IF(F31=\"Ja\",D8-'Format ark'!D13,D8))),0)+IF(AND(D11=\"Ja\",F32=\"Nej\"),D32* IF(D8>261,(IF(F32=\"Ja\",260-'Format ark'!D13,260)),IF(D8<=260,IF(F32=\"Ja\",D8-'Format ark'!D13,D8))),0)+IF(AND(D11=\"Ja\",F33=\"Nej\"),D33* IF(D8>261,(IF(F33=\"Ja\",260-'Format ark'!D13,260)),IF(D8<=260,IF(F33=\"Ja\",D8-'Format ark'!D13,D8))),0)+IF(AND(D11=\"Ja\",F34=\"Nej\"),D34* IF(D8>261,(IF(F34=\"Ja\",260-'Format ark'!D13,260)),IF(D8<=260,IF(F34=\"Ja\",D8-'Format ark'!D13,D8))),0)+IF(AND(D11=\"Ja\",F35=\"Nej\"),D35* IF(D8>261,(IF(F35=\"Ja\",260-'Format ark'!D13,260)),IF(D8<=260,IF(F35=\"Ja\",D8-'Format ark'!D13,D8))),0)+IF(AND(D11=\"Ja\",F36=\"Nej\"),D36* IF(D8>261,(IF(F36=\"Ja\",260-'Format ark'!D13,260)),IF(D8<=260,IF(F36=\"Ja\",D8-'Format ark'!D13,D8))),0)+IF(AND(D11=\"Ja\",F37=\"Nej\"),D37* IF(D8>261,(IF(F37=\"Ja\",260-'Format ark'!D13,260)),IF(D8<=260,IF(F37=\"Ja\",D8-'Format ark'!D13,D8))),0)+IF(AND(D11=\"Ja\",F38=\"Nej\"),D38* IF(D8>261,(IF(F38=\"Ja\",260-'Format ark'!D13,260)),IF(D8<=260,IF(F38=\"Ja\",D8-'Format ark'!D13,D8))),0)+IF(AND(D11=\"Ja\",F39=\"Nej\"),D39* IF(D8>261,(IF(F39=\"Ja\",260-'Format ark'!D13,260)),IF(D8<=260,IF(F39=\"Ja\",D8-'Format ark'!D13,D8))),0)+IF(AND(D11=\"Ja\",F40=\"Nej\"),D40* IF(D8>261,(IF(F40=\"Ja\",260-'Format ark'!D13,260)),IF(D8<=260,IF(F40=\"Ja\",D8-'Format ark'!D13,D8))),0)","v":0}]
[null,"Estimeret VEU-godtgørelse",null,{"$f":"IF(AND(D11=\"Ja\",F29=\"Ja\"),D29*'Format ark'!D13,0)+IF(AND(D11=\"Ja\",F30=\"Ja\"),D30*'Format ark'!D13,0)+IF(AND(D11=\"Ja\",F31=\"Ja\"),D31*'Format ark'!D13,0)+IF(AND(D11=\"Ja\",F32=\"Ja\"),D32*('Format ark'!D13),0)+IF(AND(D11=\"Ja\",F33=\"Ja\"),D33*'Format ark'!D13,0)+IF(AND(D11=\"Ja\",F34=\"Ja\"),D34*'Format ark'!D13,0)+IF(AND(D11=\"Ja\",F35=\"Ja\"),D35*'Format ark'!D13,0)+IF(AND(D11=\"Ja\",F36=\"Ja\"),D36*'Format ark'!D13,0)+IF(AND(D11=\"Ja\",F37=\"Ja\"),D37*'Format ark'!D13,0)+IF(AND(D11=\"Ja\",F38=\"Ja\"),D38*'Format ark'!D13,0)+IF(AND(D11=\"Ja\",F39=\"Ja\"),D39*'Format ark'!D13,0)+IF(AND(D11=\"Ja\",F40=\"Ja\"),D40*'Format ark'!D13,0)","v":0}]
[null,"Samlet deltagerbetaling (udregner selv)",null,{"$f":"SUM(E29:E40)","v":0}]
[]
[null,"Praktik"]
[null,"Navn på virksomhed og p-nummer"]
[null,"Medarbejderens timeforbrug",null,null,{"$f":"IF(D48>C51*0.5,\"Praktik må maksimalt udgøre 50% af det samlede tidsforbrug.\",\" \")","v":" "}]
[null,"Samlet lønkompensation for praktikopholdet",null,{"$f":"IF(D48>C51*0.5,\"IKKE MULIGT\",D48*(IF(D8>261,260,D8)))","v":0}]
[]
[null,"Samlet tidsforbrug ",{"$f":"IF(D48+D41+D23>300,\"IKKE MULIGT\",D48+D41+D23)","v":0},{"$f":"IF(C51>300,\"Det maksimale tidsforbrug er 300 timer\",\" \")","v":" "}]
[]
[null,"Tidsforbrug til administration","Antal timer","Beløb"]
[null,"Der kan godtgøres op til 5 timer.",null,{"$f":"IF(C54>5,\"Der kan maksimalt godtgøres 5 timer pr. medarbejder.\",C54*260)","v":0}]
[]
[null,"Samlet tilsagnsramme i kr. (maksimal støtte til sporskiftepakken): ",null,{"$f":"IF(C51>300,0,MIN(D49+D44+D42+D26+D24+D54,120000))","v":0},{"$f":"IF(D56=120000,\"Det maksimale tilsagn pr. sporskiftepakke er nået, og det overstigende beløb er derfor selvbetaling.\",\"\")","v":""}]
[]
[]
[null,"Estimeret VEU-godtgørelse",null,{"$f":"D43+D25","v":0}]
[]
[null,"Selvbetaling i kr. (udgifter udover den øvre tilsagnsramme)",null,{"$f":"IF(C51>300,0,IF(D56=120000,D44+D26+D42+D49+D24+D54-120000,0))","v":0}]

{"sheet":"Medarbejder 23","index":23,"n_rows":61,"n_cols":6,"rows_kept":61,"cut":false,"hidden":true,"merged":[[6,1,6,2],[8,1,8,2],[7,1,7,2],[55,1,56,2],[8,4,8,5],[21,1,21,2],[9,1,9,2],[9,4,9,5],[10,1,10,2],[11,1,11,3],[12,1,12,3],[17,1,17,2],[18,1,18,2],[19,1,19,2],[20,1,20,2],[55,3,56,3],[16,1,16,2],[33,1,33,2],[34,1,34,2],[27,1,27,2],[28,1,28,2],[29,1,29,2],[30,1,30,2],[31,1,31,2],[32,1,32,2],[35,1,35,2],[36,1,36,2],[37,1,37,2],[38,1,38,2],[39,1,39,2]]}
[]
[null,null,"Budget/Regnskab for sporskiftepakken"]
[]
[null,null,"Oplysninger om medarbejderen"]
[]
[null,null,"Medarbejder 23"]
[null,"Medarbejderens lønkompensation fra sporskifte (kr./t.)",null,{"$f":"IF(D8>261,(IF(D11=\"Ja\",260-'Format ark'!D13,260)),IF(D8<=260,IF(D11=\"Ja\",IF(D8<'Format ark'!D13,0,D8-'Format ark'!D13),D8)))","v":0}]
[null,"Medarbejderens timesats (kr./t.)"]
[null,"Medarbejderens højst gennemførte uddannelse",null,null,{"$f":"IF(D9=\"\",\"Husk at vælge medarbejderens højst gennemførte uddannelse.\",\" \")","v":"Husk at vælge medarbejderens højst gennemførte uddannelse."}]
[null,"Har medarbejderen brugt sin uddannelse de senest 5 år?",null,null,{"$f":"IF(D10=\"\",\"Husk at svare på spørgsmålet.\",\" \")","v":"Husk at svare på spørgsmålet."}]
[null,"Medarbejder formodes at være berettiget til at få VEU-godtgørelse ",null,{"$f":"IF(OR(D9=\"Videregående uddannelse\",D9=\"Gymnasial uddannelse\")*AND(D10=\"ja\"),\"Nej\",\"Ja\")","v":"Ja"}]
[null,"Beskriv herunder hvad formålet med den planlagte sporskiftepakke er for medarbejderen:"]
[]
[]
[null,null,"Aktiviteter"]
[]
[null,"Afklaring, vejledning mv. \nSkriv navn på kursus",null,"Medarbejderens timeforbug (timer)","Evt. deltagerbetaling (kr.)","Giver kurset ret til VEU-godtgørelse?"]
[]
[]
[]
[]
[]
[null,"Samlet antal timer (udregner selv)",null,{"$f":"SUM(D18:D22)","v":0}]
[null,"Samlet lønkompensation udover evt. VEU-godtgørelse (udregner selv)",null,{"$f":"IF(D11=\"Nej\",D23*D7,0)+IF(AND(D11=\"Ja\",F18=\"Ja\"),D18*D7,0)+IF(AND(D11=\"Ja\",F19=\"Ja\"),D19*D7,0)+IF(AND(D11=\"Ja\",F20=\"Ja\"),D20*D7,0)+IF(AND(D11=\"Ja\",F21=\"Ja\"),D21*D7,0)+IF(AND(D11=\"Ja\",F22=\"Ja\"),D22*D7,0)+IF(AND(D11=\"Ja\",F18=\"Nej\"),D18*IF(D8>261,(IF(F18=\"Ja\",260-'Format ark'!D13,260)),IF(D8<=260,IF(F18=\"Ja\",D8-'Format ark'!D13,D8))),0)+IF(AND(D11=\"Ja\",F19=\"Nej\"),D19*IF(D8>261,(IF(F19=\"Ja\",260-'Format ark'!D13,260)),IF(D8<=260,IF(F19=\"Ja\",D8-'Format ark'!D13,D8))),0)+IF(AND(D11=\"Ja\",F20=\"Nej\"),D20*IF(D8>261,(IF(F20=\"Ja\",260-'Format ark'!D13,260)),IF(D8<=260,IF(F20=\"Ja\",D8-'Format ark'!D13,D8))),0)+IF(AND(D11=\"Ja\",F21=\"Nej\"),D21*IF(D8>261,(IF(F21=\"Ja\",260-'Format ark'!D13,260)),IF(D8<=260,IF(F21=\"Ja\",D8-'Format ark'!D13,D8))),0)+IF(AND(D11=\"Ja\",F22=\"Nej\"),D22*IF(D8>261,(IF(F22=\"Ja\",260-'Format ark'!D13,260)),IF(D8<=260,IF(F22=\"Ja\",D8-'Format ark'!D13,D8))),0)","v":0}]
[null,"Estimeret VEU-godtgørelse",null,{"$f":"IF(AND(D11=\"Ja\",F18=\"Ja\"),D18*'Format ark'!D13,0)+IF(AND(D11=\"Ja\",F19=\"Ja\"),D19*'Format ark'!D13,0)+IF(AND(D11=\"Ja\",F20=\"Ja\"),D20*'Format ark'!D13,0)+IF(AND(D11=\"Ja\",F21=\"Ja\"),D21*'Format ark'!D13,0)+IF(AND(D11=\"Ja\",F22=\"Ja\"),D22*'Format ark'!D13,0)","v":0}]
[null,"Samlet deltagerbeltaing (udregner selv)",null,{"$f":"SUM(E18:E22)","v":0}]
[]
[null,"Erhversrettet efteruddannelse\nSkriv navn på efteruddannelse",null,"Medarbejderens timeforbrug (timer)","Evt. deltagerbetaling (kr.)","Giver kurset ret til VEU-godtgørelse?"]
[]
[]
[]
[]
[]
[]
[]
[]
[]
[]
[]
[null,"Kørsel/transport (angives som faktisk udgift)",null,null,null,"Nej"]
[null,"Samlet antal timer (udregner selv)",null,{"$f":"SUM(D29:D40)","v":0}]
[null,"Samlet lønkompensation udover evt. VEU-godtgørelse (udregner selv)",null,{"$f":"IF(D11=\"Nej\",D41*D7,0)+IF(AND(D11=\"Ja\",F29=\"Ja\"),D29*D7,0)+IF(AND(D11=\"Ja\",F30=\"Ja\"),D30*D7,0)+IF(AND(D11=\"Ja\",F31=\"Ja\"),D31*D7,0)+IF(AND(D11=\"Ja\",F32=\"Ja\"),D32*D7,0)+IF(AND(D11=\"Ja\",F33=\"Ja\"),D33*D7,0)+IF(AND(D11=\"Ja\",F34=\"Ja\"),D34*D7,0)+IF(AND(D11=\"Ja\",F35=\"Ja\"),D35*D7,0)+IF(AND(D11=\"Ja\",F36=\"Ja\"),D36*D7,0)+IF(AND(D11=\"Ja\",F37=\"Ja\"),D37*D7,0)+IF(AND(D11=\"Ja\",F38=\"Ja\"),D38*D7,0)+IF(AND(D11=\"Ja\",F39=\"Ja\"),D39*D7,0)+IF(AND(D11=\"Ja\",F40=\"Ja\"),D40*D7,0)+IF(AND(D11=\"Ja\",F29=\"Nej\"),D29* IF(D8>261,(IF(F29=\"Ja\",260-'Format ark'!D13,260)),IF(D8<=260,IF(F29=\"Ja\",D8-'Format ark'!D13,D8))),0)+IF(AND(D11=\"Ja\",F30=\"Nej\"),D30* IF(D8>261,(IF(F30=\"Ja\",260-'Format ark'!D13,260)),IF(D8<=260,IF(F30=\"Ja\",D8-'Format ark'!D13,D8))),0)+IF(AND(D11=\"Ja\",F31=\"Nej\"),D31* IF(D8>261,(IF(F31=\"Ja\",260-'Format ark'!D13,260)),IF(D8<=260,IF(F31=\"Ja\",D8-'Format ark'!D13,D8))),0)+IF(AND(D11=\"Ja\",F32=\"Nej\"),D32* IF(D8>261,(IF(F32=\"Ja\",260-'Format ark'!D13,260)),IF(D8<=260,IF(F32=\"Ja\",D8-'Format ark'!D13,D8))),0)+IF(AND(D11=\"Ja\",F33=\"Nej\"),D33* IF(D8>261,(IF(F33=\"Ja\",260-'Format ark'!D13,260)),IF(D8<=260,IF(F33=\"Ja\",D8-'Format ark'!D13,D8))),0)+IF(AND(D11=\"Ja\",F34=\"Nej\"),D34* IF(D8>261,(IF(F34=\"Ja\",260-'Format ark'!D13,260)),IF(D8<=260,IF(F34=\"Ja\",D8-'Format ark'!D13,D8))),0)+IF(AND(D11=\"Ja\",F35=\"Nej\"),D35* IF(D8>261,(IF(F35=\"Ja\",260-'Format ark'!D13,260)),IF(D8<=260,IF(F35=\"Ja\",D8-'Format ark'!D13,D8))),0)+IF(AND(D11=\"Ja\",F36=\"Nej\"),D36* IF(D8>261,(IF(F36=\"Ja\",260-'Format ark'!D13,260)),IF(D8<=260,IF(F36=\"Ja\",D8-'Format ark'!D13,D8))),0)+IF(AND(D11=\"Ja\",F37=\"Nej\"),D37* IF(D8>261,(IF(F37=\"Ja\",260-'Format ark'!D13,260)),IF(D8<=260,IF(F37=\"Ja\",D8-'Format ark'!D13,D8))),0)+IF(AND(D11=\"Ja\",F38=\"Nej\"),D38* IF(D8>261,(IF(F38=\"Ja\",260-'Format ark'!D13,260)),IF(D8<=260,IF(F38=\"Ja\",D8-'Format ark'!D13,D8))),0)+IF(AND(D11=\"Ja\",F39=\"Nej\"),D39* IF(D8>261,(IF(F39=\"Ja\",260-'Format ark'!D13,260)),IF(D8<=260,IF(F39=\"Ja\",D8-'Format ark'!D13,D8))),0)+IF(AND(D11=\"Ja\",F40=\"Nej\"),D40* IF(D8>261,(IF(F40=\"Ja\",260-'Format ark'!D13,260)),IF(D8<=260,IF(F40=\"Ja\",D8-'Format ark'!D13,D8))),0)","v":0}]
[null,"Estimeret VEU-godtgørelse",null,{"$f":"IF(AND(D11=\"Ja\",F29=\"Ja\"),D29*'Format ark'!D13,0)+IF(AND(D11=\"Ja\",F30=\"Ja\"),D30*'Format ark'!D13,0)+IF(AND(D11=\"Ja\",F31=\"Ja\"),D31*'Format ark'!D13,0)+IF(AND(D11=\"Ja\",F32=\"Ja\"),D32*('Format ark'!D13),0)+IF(AND(D11=\"Ja\",F33=\"Ja\"),D33*'Format ark'!D13,0)+IF(AND(D11=\"Ja\",F34=\"Ja\"),D34*'Format ark'!D13,0)+IF(AND(D11=\"Ja\",F35=\"Ja\"),D35*'Format ark'!D13,0)+IF(AND(D11=\"Ja\",F36=\"Ja\"),D36*'Format ark'!D13,0)+IF(AND(D11=\"Ja\",F37=\"Ja\"),D37*'Format ark'!D13,0)+IF(AND(D11=\"Ja\",F38=\"Ja\"),D38*'Format ark'!D13,0)+IF(AND(D11=\"Ja\",F39=\"Ja\"),D39*'Format ark'!D13,0)+IF(AND(D11=\"Ja\",F40=\"Ja\"),D40*'Format ark'!D13,0)","v":0}]
[null,"Samlet deltagerbetaling (udregner selv)",null,{"$f":"SUM(E29:E40)","v":0}]
[]
[null,"Praktik"]
[null,"Navn på virksomhed og p-nummer"]
[null,"Medarbejderens timeforbrug",null,null,{"$f":"IF(D48>C51*0.5,\"Praktik må maksimalt udgøre 50% af det samlede tidsforbrug.\",\" \")","v":" "}]
[null,"Samlet lønkompensation for praktikopholdet",null,{"$f":"IF(D48>C51*0.5,\"IKKE MULIGT\",D48*(IF(D8>261,260,D8)))","v":0}]
[]
[null,"Samlet tidsforbrug ",{"$f":"IF(D48+D41+D23>300,\"IKKE MULIGT\",D48+D41+D23)","v":0},{"$f":"IF(C51>300,\"Det maksimale tidsforbrug er 300 timer\",\" \")","v":" "}]
[]
[null,"Tidsforbrug til administration","Antal timer","Beløb"]
[null,"Der kan godtgøres op til 5 timer.",null,{"$f":"IF(C54>5,\"Der kan maksimalt godtgøres 5 timer pr. medarbejder.\",C54*260)","v":0}]
[]
[null,"Samlet tilsagnsramme i kr. (maksimal støtte til sporskiftepakken): ",null,{"$f":"IF(C51>300,0,MIN(D49+D44+D42+D26+D24+D54,120000))","v":0},{"$f":"IF(D56=120000,\"Det maksimale tilsagn pr. sporskiftepakke er nået, og det overstigende beløb er derfor selvbetaling.\",\"\")","v":""}]
[]
[]
[null,"Estimeret VEU-godtgørelse",null,{"$f":"D43+D25","v":0}]
[]
[null,"Selvbetaling i kr. (udgifter udover den øvre tilsagnsramme)",null,{"$f":"IF(C51>300,0,IF(D56=120000,D44+D26+D42+D49+D24+D54-120000,0))","v":0}]

{"sheet":"Medarbejder 24","index":24,"n_rows":61,"n_cols":6,"rows_kept":61,"cut":false,"hidden":true,"merged":[[6,1,6,2],[8,1,8,2],[7,1,7,2],[55,1,56,2],[8,4,8,5],[21,1,21,2],[9,1,9,2],[9,4,9,5],[10,1,10,2],[11,1,11,3],[12,1,12,3],[17,1,17,2],[18,1,18,2],[19,1,19,2],[20,1,20,2],[55,3,56,3],[16,1,16,2],[33,1,33,2],[34,1,34,2],[27,1,27,2],[28,1,28,2],[29,1,29,2],[30,1,30,2],[31,1,31,2],[32,1,32,2],[35,1,35,2],[36,1,36,2],[37,1,37,2],[38,1,38,2],[39,1,39,2]]}
[]
[null,null,"Budget/Regnskab for sporskiftepakken"]
[]
[null,null,"Oplysninger om medarbejderen"]
[]
[null,null,"Medarbejder 24"]
[null,"Medarbejderens lønkompensation fra sporskifte (kr./t.)",null,{"$f":"IF(D8>261,(IF(D11=\"Ja\",260-'Format ark'!D13,260)),IF(D8<=260,IF(D11=\"Ja\",IF(D8<'Format ark'!D13,0,D8-'Format ark'!D13),D8)))","v":0}]
[null,"Medarbejderens timesats (kr./t.)"]
[null,"Medarbejderens højst gennemførte uddannelse",null,null,{"$f":"IF(D9=\"\",\"Husk at vælge medarbejderens højst gennemførte uddannelse.\",\" \")","v":"Husk at vælge medarbejderens højst gennemførte uddannelse."}]
[null,"Har medarbejderen brugt sin uddannelse de senest 5 år?",null,null,{"$f":"IF(D10=\"\",\"Husk at svare på spørgsmålet.\",\" \")","v":"Husk at svare på spørgsmålet."}]
[null,"Medarbejder formodes at være berettiget til at få VEU-godtgørelse ",null,{"$f":"IF(OR(D9=\"Videregående uddannelse\",D9=\"Gymnasial uddannelse\")*AND(D10=\"ja\"),\"Nej\",\"Ja\")","v":"Ja"}]
[null,"Beskriv herunder hvad formålet med den planlagte sporskiftepakke er for medarbejderen:"]
[]
[]
[null,null,"Aktiviteter"]
[]
[null,"Afklaring, vejledning mv. \nSkriv navn på kursus",null,"Medarbejderens timeforbug (timer)","Evt. deltagerbetaling (kr.)","Giver kurset ret til VEU-godtgørelse?"]
[]
[]
[]
[]
[]
[null,"Samlet antal timer (udregner selv)",null,{"$f":"SUM(D18:D22)","v":0}]
[null,"Samlet lønkompensation udover evt. VEU-godtgørelse (udregner selv)",null,{"$f":"IF(D11=\"Nej\",D23*D7,0)+IF(AND(D11=\"Ja\",F18=\"Ja\"),D18*D7,0)+IF(AND(D11=\"Ja\",F19=\"Ja\"),D19*D7,0)+IF(AND(D11=\"Ja\",F20=\"Ja\"),D20*D7,0)+IF(AND(D11=\"Ja\",F21=\"Ja\"),D21*D7,0)+IF(AND(D11=\"Ja\",F22=\"Ja\"),D22*D7,0)+IF(AND(D11=\"Ja\",F18=\"Nej\"),D18*IF(D8>261,(IF(F18=\"Ja\",260-'Format ark'!D13,260)),IF(D8<=260,IF(F18=\"Ja\",D8-'Format ark'!D13,D8))),0)+IF(AND(D11=\"Ja\",F19=\"Nej\"),D19*IF(D8>261,(IF(F19=\"Ja\",260-'Format ark'!D13,260)),IF(D8<=260,IF(F19=\"Ja\",D8-'Format ark'!D13,D8))),0)+IF(AND(D11=\"Ja\",F20=\"Nej\"),D20*IF(D8>261,(IF(F20=\"Ja\",260-'Format ark'!D13,260)),IF(D8<=260,IF(F20=\"Ja\",D8-'Format ark'!D13,D8))),0)+IF(AND(D11=\"Ja\",F21=\"Nej\"),D21*IF(D8>261,(IF(F21=\"Ja\",260-'Format ark'!D13,260)),IF(D8<=260,IF(F21=\"Ja\",D8-'Format ark'!D13,D8))),0)+IF(AND(D11=\"Ja\",F22=\"Nej\"),D22*IF(D8>261,(IF(F22=\"Ja\",260-'Format ark'!D13,260)),IF(D8<=260,IF(F22=\"Ja\",D8-'Format ark'!D13,D8))),0)","v":0}]
[null,"Estimeret VEU-godtgørelse",null,{"$f":"IF(AND(D11=\"Ja\",F18=\"Ja\"),D18*'Format ark'!D13,0)+IF(AND(D11=\"Ja\",F19=\"Ja\"),D19*'Format ark'!D13,0)+IF(AND(D11=\"Ja\",F20=\"Ja\"),D20*'Format ark'!D13,0)+IF(AND(D11=\"Ja\",F21=\"Ja\"),D21*'Format ark'!D13,0)+IF(AND(D11=\"Ja\",F22=\"Ja\"),D22*'Format ark'!D13,0)","v":0}]
[null,"Samlet deltagerbeltaing (udregner selv)",null,{"$f":"SUM(E18:E22)","v":0}]
[]
[null,"Erhversrettet efteruddannelse\nSkriv navn på efteruddannelse",null,"Medarbejderens timeforbrug (timer)","Evt. deltagerbetaling (kr.)","Giver kurset ret til VEU-godtgørelse?"]
[]
[]
[]
[]
[]
[]
[]
[]
[]
[]
[]
[null,"Kørsel/transport (angives som faktisk udgift)",null,null,null,"Nej"]
[null,"Samlet antal timer (udregner selv)",null,{"$f":"SUM(D29:D40)","v":0}]
[null,"Samlet lønkompensation udover evt. VEU-godtgørelse (udregner selv)",null,{"$f":"IF(D11=\"Nej\",D41*D7,0)+IF(AND(D11=\"Ja\",F29=\"Ja\"),D29*D7,0)+IF(AND(D11=\"Ja\",F30=\"Ja\"),D30*D7,0)+IF(AND(D11=\"Ja\",F31=\"Ja\"),D31*D7,0)+IF(AND(D11=\"Ja\",F32=\"Ja\"),D32*D7,0)+IF(AND(D11=\"Ja\",F33=\"Ja\"),D33*D7,0)+IF(AND(D11=\"Ja\",F34=\"Ja\"),D34*D7,0)+IF(AND(D11=\"Ja\",F35=\"Ja\"),D35*D7,0)+IF(AND(D11=\"Ja\",F36=\"Ja\"),D36*D7,0)+IF(AND(D11=\"Ja\",F37=\"Ja\"),D37*D7,0)+IF(AND(D11=\"Ja\",F38=\"Ja\"),D38*D7,0)+IF(AND(D11=\"Ja\",F39=\"Ja\"),D39*D7,0)+IF(AND(D11=\"Ja\",F40=\"Ja\"),D40*D7,0)+IF(AND(D11=\"Ja\",F29=\"Nej\"),D29* IF(D8>261,(IF(F29=\"Ja\",260-'Format ark'!D13,260)),IF(D8<=260,IF(F29=\"Ja\",D8-'Format ark'!D13,D8))),0)+IF(AND(D11=\"Ja\",F30=\"Nej\"),D30* IF(D8>261,(IF(F30=\"Ja\",260-'Format ark'!D13,260)),IF(D8<=260,IF(F30=\"Ja\",D8-'Format ark'!D13,D8))),0)+IF(AND(D11=\"Ja\",F31=\"Nej\"),D31* IF(D8>261,(IF(F31=\"Ja\",260-'Format ark'!D13,260)),IF(D8<=260,IF(F31=\"Ja\",D8-'Format ark'!D13,D8))),0)+IF(AND(D11=\"Ja\",F32=\"Nej\"),D32* IF(D8>261,(IF(F32=\"Ja\",260-'Format ark'!D13,260)),IF(D8<=260,IF(F32=\"Ja\",D8-'Format ark'!D13,D8))),0)+IF(AND(D11=\"Ja\",F33=\"Nej\"),D33* IF(D8>261,(IF(F33=\"Ja\",260-'Format ark'!D13,260)),IF(D8<=260,IF(F33=\"Ja\",D8-'Format ark'!D13,D8))),0)+IF(AND(D11=\"Ja\",F34=\"Nej\"),D34* IF(D8>261,(IF(F34=\"Ja\",260-'Format ark'!D13,260)),IF(D8<=260,IF(F34=\"Ja\",D8-'Format ark'!D13,D8))),0)+IF(AND(D11=\"Ja\",F35=\"Nej\"),D35* IF(D8>261,(IF(F35=\"Ja\",260-'Format ark'!D13,260)),IF(D8<=260,IF(F35=\"Ja\",D8-'Format ark'!D13,D8))),0)+IF(AND(D11=\"Ja\",F36=\"Nej\"),D36* IF(D8>261,(IF(F36=\"Ja\",260-'Format ark'!D13,260)),IF(D8<=260,IF(F36=\"Ja\",D8-'Format ark'!D13,D8))),0)+IF(AND(D11=\"Ja\",F37=\"Nej\"),D37* IF(D8>261,(IF(F37=\"Ja\",260-'Format ark'!D13,260)),IF(D8<=260,IF(F37=\"Ja\",D8-'Format ark'!D13,D8))),0)+IF(AND(D11=\"Ja\",F38=\"Nej\"),D38* IF(D8>261,(IF(F38=\"Ja\",260-'Format ark'!D13,260)),IF(D8<=260,IF(F38=\"Ja\",D8-'Format ark'!D13,D8))),0)+IF(AND(D11=\"Ja\",F39=\"Nej\"),D39* IF(D8>261,(IF(F39=\"Ja\",260-'Format ark'!D13,260)),IF(D8<=260,IF(F39=\"Ja\",D8-'Format ark'!D13,D8))),0)+IF(AND(D11=\"Ja\",F40=\"Nej\"),D40* IF(D8>261,(IF(F40=\"Ja\",260-'Format ark'!D13,260)),IF(D8<=260,IF(F40=\"Ja\",D8-'Format ark'!D13,D8))),0)","v":0}]
[null,"Estimeret VEU-godtgørelse",null,{"$f":"IF(AND(D11=\"Ja\",F29=\"Ja\"),D29*'Format ark'!D13,0)+IF(AND(D11=\"Ja\",F30=\"Ja\"),D30*'Format ark'!D13,0)+IF(AND(D11=\"Ja\",F31=\"Ja\"),D31*'Format ark'!D13,0)+IF(AND(D11=\"Ja\",F32=\"Ja\"),D32*('Format ark'!D13),0)+IF(AND(D11=\"Ja\",F33=\"Ja\"),D33*'Format ark'!D13,0)+IF(AND(D11=\"Ja\",F34=\"Ja\"),D34*'Format ark'!D13,0)+IF(AND(D11=\"Ja\",F35=\"Ja\"),D35*'Format ark'!D13,0)+IF(AND(D11=\"Ja\",F36=\"Ja\"),D36*'Format ark'!D13,0)+IF(AND(D11=\"Ja\",F37=\"Ja\"),D37*'Format ark'!D13,0)+IF(AND(D11=\"Ja\",F38=\"Ja\"),D38*'Format ark'!D13,0)+IF(AND(D11=\"Ja\",F39=\"Ja\"),D39*'Format ark'!D13,0)+IF(AND(D11=\"Ja\",F40=\"Ja\"),D40*'Format ark'!D13,0)","v":0}]
[null,"Samlet deltagerbetaling (udregner selv)",null,{"$f":"SUM(E29:E40)","v":0}]
[]
[null,"Praktik"]
[null,"Navn på virksomhed og p-nummer"]
[null,"Medarbejderens timeforbrug",null,null,{"$f":"IF(D48>C51*0.5,\"Praktik må maksimalt udgøre 50% af det samlede tidsforbrug.\",\" \")","v":" "}]
[null,"Samlet lønkompensation for praktikopholdet",null,{"$f":"IF(D48>C51*0.5,\"IKKE MULIGT\",D48*(IF(D8>261,260,D8)))","v":0}]
[]
[null,"Samlet tidsforbrug ",{"$f":"IF(D48+D41+D23>300,\"IKKE MULIGT\",D48+D41+D23)","v":0},{"$f":"IF(C51>300,\"Det maksimale tidsforbrug er 300 timer\",\" \")","v":" "}]
[]
[null,"Tidsforbrug til administration","Antal timer","Beløb"]
[null,"Der kan godtgøres op til 5 timer.",null,{"$f":"IF(C54>5,\"Der kan maksimalt godtgøres 5 timer pr. medarbejder.\",C54*260)","v":0}]
[]
[null,"Samlet tilsagnsramme i kr. (maksimal støtte til sporskiftepakken): ",null,{"$f":"IF(C51>300,0,MIN(D49+D44+D42+D26+D24+D54,120000))","v":0},{"$f":"IF(D56=120000,\"Det maksimale tilsagn pr. sporskiftepakke er nået, og det overstigende beløb er derfor selvbetaling.\",\"\")","v":""}]
[]
[]
[null,"Estimeret VEU-godtgørelse",null,{"$f":"D43+D25","v":0}]
[]
[null,"Selvbetaling i kr. (udgifter udover den øvre tilsagnsramme)",null,{"$f":"IF(C51>300,0,IF(D56=120000,D44+D26+D42+D49+D24+D54-120000,0))","v":0}]

{"sheet":"Medarbejder 25","index":25,"n_rows":61,"n_cols":6,"rows_kept":61,"cut":false,"hidden":true,"merged":[[6,1,6,2],[8,1,8,2],[7,1,7,2],[55,1,56,2],[8,4,8,5],[21,1,21,2],[9,1,9,2],[9,4,9,5],[10,1,10,2],[11,1,11,3],[12,1,12,3],[17,1,17,2],[18,1,18,2],[19,1,19,2],[20,1,20,2],[55,3,56,3],[16,1,16,2],[33,1,33,2],[34,1,34,2],[27,1,27,2],[28,1,28,2],[29,1,29,2],[30,1,30,2],[31,1,31,2],[32,1,32,2],[35,1,35,2],[36,1,36,2],[37,1,37,2],[38,1,38,2],[39,1,39,2]]}
[]
[null,null,"Budget/Regnskab for sporskiftepakken"]
[]
[null,null,"Oplysninger om medarbejderen"]
[]
[null,null,"Medarbejder 25"]
[null,"Medarbejderens lønkompensation fra sporskifte (kr./t.)",null,{"$f":"IF(D8>261,(IF(D11=\"Ja\",260-'Format ark'!D13,260)),IF(D8<=260,IF(D11=\"Ja\",IF(D8<'Format ark'!D13,0,D8-'Format ark'!D13),D8)))","v":0}]
[null,"Medarbejderens timesats (kr./t.)"]
[null,"Medarbejderens højst gennemførte uddannelse",null,null,{"$f":"IF(D9=\"\",\"Husk at vælge medarbejderens højst gennemførte uddannelse.\",\" \")","v":"Husk at vælge medarbejderens højst gennemførte uddannelse."}]
[null,"Har medarbejderen brugt sin uddannelse de senest 5 år?",null,null,{"$f":"IF(D10=\"\",\"Husk at svare på spørgsmålet.\",\" \")","v":"Husk at svare på spørgsmålet."}]
[null,"Medarbejder formodes at være berettiget til at få VEU-godtgørelse ",null,{"$f":"IF(OR(D9=\"Videregående uddannelse\",D9=\"Gymnasial uddannelse\")*AND(D10=\"ja\"),\"Nej\",\"Ja\")","v":"Ja"}]
[null,"Beskriv herunder hvad formålet med den planlagte sporskiftepakke er for medarbejderen:"]
[]
[]
[null,null,"Aktiviteter"]
[]
[null,"Afklaring, vejledning mv. \nSkriv navn på kursus",null,"Medarbejderens timeforbug (timer)","Evt. deltagerbetaling (kr.)","Giver kurset ret til VEU-godtgørelse?"]
[]
[]
[]
[]
[]
[null,"Samlet antal timer (udregner selv)",null,{"$f":"SUM(D18:D22)","v":0}]
[null,"Samlet lønkompensation udover evt. VEU-godtgørelse (udregner selv)",null,{"$f":"IF(D11=\"Nej\",D23*D7,0)+IF(AND(D11=\"Ja\",F18=\"Ja\"),D18*D7,0)+IF(AND(D11=\"Ja\",F19=\"Ja\"),D19*D7,0)+IF(AND(D11=\"Ja\",F20=\"Ja\"),D20*D7,0)+IF(AND(D11=\"Ja\",F21=\"Ja\"),D21*D7,0)+IF(AND(D11=\"Ja\",F22=\"Ja\"),D22*D7,0)+IF(AND(D11=\"Ja\",F18=\"Nej\"),D18*IF(D8>261,(IF(F18=\"Ja\",260-'Format ark'!D13,260)),IF(D8<=260,IF(F18=\"Ja\",D8-'Format ark'!D13,D8))),0)+IF(AND(D11=\"Ja\",F19=\"Nej\"),D19*IF(D8>261,(IF(F19=\"Ja\",260-'Format ark'!D13,260)),IF(D8<=260,IF(F19=\"Ja\",D8-'Format ark'!D13,D8))),0)+IF(AND(D11=\"Ja\",F20=\"Nej\"),D20*IF(D8>261,(IF(F20=\"Ja\",260-'Format ark'!D13,260)),IF(D8<=260,IF(F20=\"Ja\",D8-'Format ark'!D13,D8))),0)+IF(AND(D11=\"Ja\",F21=\"Nej\"),D21*IF(D8>261,(IF(F21=\"Ja\",260-'Format ark'!D13,260)),IF(D8<=260,IF(F21=\"Ja\",D8-'Format ark'!D13,D8))),0)+IF(AND(D11=\"Ja\",F22=\"Nej\"),D22*IF(D8>261,(IF(F22=\"Ja\",260-'Format ark'!D13,260)),IF(D8<=260,IF(F22=\"Ja\",D8-'Format ark'!D13,D8))),0)","v":0}]
[null,"Estimeret VEU-godtgørelse",null,{"$f":"IF(AND(D11=\"Ja\",F18=\"Ja\"),D18*'Format ark'!D13,0)+IF(AND(D11=\"Ja\",F19=\"Ja\"),D19*'Format ark'!D13,0)+IF(AND(D11=\"Ja\",F20=\"Ja\"),D20*'Format ark'!D13,0)+IF(AND(D11=\"Ja\",F21=\"Ja\"),D21*'Format ark'!D13,0)+IF(AND(D11=\"Ja\",F22=\"Ja\"),D22*'Format ark'!D13,0)","v":0}]
[null,"Samlet deltagerbeltaing (udregner selv)",null,{"$f":"SUM(E18:E22)","v":0}]
[]
[null,"Erhversrettet efteruddannelse\nSkriv navn på efteruddannelse",null,"Medarbejderens timeforbrug (timer)","Evt. deltagerbetaling (kr.)","Giver kurset ret til VEU-godtgørelse?"]
[]
[]
[]
[]
[]
[]
[]
[]
[]
[]
[]
[null,"Kørsel/transport (angives som faktisk udgift)",null,null,null,"Nej"]
[null,"Samlet antal timer (udregner selv)",null,{"$f":"SUM(D29:D40)","v":0}]
[null,"Samlet lønkompensation udover evt. VEU-godtgørelse (udregner selv)",null,{"$f":"IF(D11=\"Nej\",D41*D7,0)+IF(AND(D11=\"Ja\",F29=\"Ja\"),D29*D7,0)+IF(AND(D11=\"Ja\",F30=\"Ja\"),D30*D7,0)+IF(AND(D11=\"Ja\",F31=\"Ja\"),D31*D7,0)+IF(AND(D11=\"Ja\",F32=\"Ja\"),D32*D7,0)+IF(AND(D11=\"Ja\",F33=\"Ja\"),D33*D7,0)+IF(AND(D11=\"Ja\",F34=\"Ja\"),D34*D7,0)+IF(AND(D11=\"Ja\",F35=\"Ja\"),D35*D7,0)+IF(AND(D11=\"Ja\",F36=\"Ja\"),D36*D7,0)+IF(AND(D11=\"Ja\",F37=\"Ja\"),D37*D7,0)+IF(AND(D11=\"Ja\",F38=\"Ja\"),D38*D7,0)+IF(AND(D11=\"Ja\",F39=\"Ja\"),D39*D7,0)+IF(AND(D11=\"Ja\",F40=\"Ja\"),D40*D7,0)+IF(AND(D11=\"Ja\",F29=\"Nej\"),D29* IF(D8>261,(IF(F29=\"Ja\",260-'Format ark'!D13,260)),IF(D8<=260,IF(F29=\"Ja\",D8-'Format ark'!D13,D8))),0)+IF(AND(D11=\"Ja\",F30=\"Nej\"),D30* IF(D8>261,(IF(F30=\"Ja\",260-'Format ark'!D13,260)),IF(D8<=260,IF(F30=\"Ja\",D8-'Format ark'!D13,D8))),0)+IF(AND(D11=\"Ja\",F31=\"Nej\"),D31* IF(D8>261,(IF(F31=\"Ja\",260-'Format ark'!D13,260)),IF(D8<=260,IF(F31=\"Ja\",D8-'Format ark'!D13,D8))),0)+IF(AND(D11=\"Ja\",F32=\"Nej\"),D32* IF(D8>261,(IF(F32=\"Ja\",260-'Format ark'!D13,260)),IF(D8<=260,IF(F32=\"Ja\",D8-'Format ark'!D13,D8))),0)+IF(AND(D11=\"Ja\",F33=\"Nej\"),D33* IF(D8>261,(IF(F33=\"Ja\",260-'Format ark'!D13,260)),IF(D8<=260,IF(F33=\"Ja\",D8-'Format ark'!D13,D8))),0)+IF(AND(D11=\"Ja\",F34=\"Nej\"),D34* IF(D8>261,(IF(F34=\"Ja\",260-'Format ark'!D13,260)),IF(D8<=260,IF(F34=\"Ja\",D8-'Format ark'!D13,D8))),0)+IF(AND(D11=\"Ja\",F35=\"Nej\"),D35* IF(D8>261,(IF(F35=\"Ja\",260-'Format ark'!D13,260)),IF(D8<=260,IF(F35=\"Ja\",D8-'Format ark'!D13,D8))),0)+IF(AND(D11=\"Ja\",F36=\"Nej\"),D36* IF(D8>261,(IF(F36=\"Ja\",260-'Format ark'!D13,260)),IF(D8<=260,IF(F36=\"Ja\",D8-'Format ark'!D13,D8))),0)+IF(AND(D11=\"Ja\",F37=\"Nej\"),D37* IF(D8>261,(IF(F37=\"Ja\",260-'Format ark'!D13,260)),IF(D8<=260,IF(F37=\"Ja\",D8-'Format ark'!D13,D8))),0)+IF(AND(D11=\"Ja\",F38=\"Nej\"),D38* IF(D8>261,(IF(F38=\"Ja\",260-'Format ark'!D13,260)),IF(D8<=260,IF(F38=\"Ja\",D8-'Format ark'!D13,D8))),0)+IF(AND(D11=\"Ja\",F39=\"Nej\"),D39* IF(D8>261,(IF(F39=\"Ja\",260-'Format ark'!D13,260)),IF(D8<=260,IF(F39=\"Ja\",D8-'Format ark'!D13,D8))),0)+IF(AND(D11=\"Ja\",F40=\"Nej\"),D40* IF(D8>261,(IF(F40=\"Ja\",260-'Format ark'!D13,260)),IF(D8<=260,IF(F40=\"Ja\",D8-'Format ark'!D13,D8))),0)","v":0}]
[null,"Estimeret VEU-godtgørelse",null,{"$f":"IF(AND(D11=\"Ja\",F29=\"Ja\"),D29*'Format ark'!D13,0)+IF(AND(D11=\"Ja\",F30=\"Ja\"),D30*'Format ark'!D13,0)+IF(AND(D11=\"Ja\",F31=\"Ja\"),D31*'Format ark'!D13,0)+IF(AND(D11=\"Ja\",F32=\"Ja\"),D32*('Format ark'!D13),0)+IF(AND(D11=\"Ja\",F33=\"Ja\"),D33*'Format ark'!D13,0)+IF(AND(D11=\"Ja\",F34=\"Ja\"),D34*'Format ark'!D13,0)+IF(AND(D11=\"Ja\",F35=\"Ja\"),D35*'Format ark'!D13,0)+IF(AND(D11=\"Ja\",F36=\"Ja\"),D36*'Format ark'!D13,0)+IF(AND(D11=\"Ja\",F37=\"Ja\"),D37*'Format ark'!D13,0)+IF(AND(D11=\"Ja\",F38=\"Ja\"),D38*'Format ark'!D13,0)+IF(AND(D11=\"Ja\",F39=\"Ja\"),D39*'Format ark'!D13,0)+IF(AND(D11=\"Ja\",F40=\"Ja\"),D40*'Format ark'!D13,0)","v":0}]
[null,"Samlet deltagerbetaling (udregner selv)",null,{"$f":"SUM(E29:E40)","v":0}]
[]
[null,"Praktik"]
[null,"Navn på virksomhed og p-nummer"]
[null,"Medarbejderens timeforbrug",null,null,{"$f":"IF(D48>C51*0.5,\"Praktik må maksimalt udgøre 50% af det samlede tidsforbrug.\",\" \")","v":" "}]
[null,"Samlet lønkompensation for praktikopholdet",null,{"$f":"IF(D48>C51*0.5,\"IKKE MULIGT\",D48*(IF(D8>261,260,D8)))","v":0}]
[]
[null,"Samlet tidsforbrug ",{"$f":"IF(D48+D41+D23>300,\"IKKE MULIGT\",D48+D41+D23)","v":0},{"$f":"IF(C51>300,\"Det maksimale tidsforbrug er 300 timer\",\" \")","v":" "}]
[]
[null,"Tidsforbrug til administration","Antal timer","Beløb"]
[null,"Der kan godtgøres op til 5 timer.",null,{"$f":"IF(C54>5,\"Der kan maksimalt godtgøres 5 timer pr. medarbejder.\",C54*260)","v":0}]
[]
[null,"Samlet tilsagnsramme i kr. (maksimal støtte til sporskiftepakken): ",null,{"$f":"IF(C51>300,0,MIN(D49+D44+D42+D26+D24+D54,120000))","v":0},{"$f":"IF(D56=120000,\"Det maksimale tilsagn pr. sporskiftepakke er nået, og det overstigende beløb er derfor selvbetaling.\",\"\")","v":""}]
[]
[]
[null,"Estimeret VEU-godtgørelse",null,{"$f":"D43+D25","v":0}]
[]
[null,"Selvbetaling i kr. (udgifter udover den øvre tilsagnsramme)",null,{"$f":"IF(C51>300,0,IF(D56=120000,D44+D26+D42+D49+D24+D54-120000,0))","v":0}]

{"sheet":"Medarbejder 26","index":26,"n_rows":61,"n_cols":6,"rows_kept":61,"cut":false,"hidden":true,"merged":[[6,1,6,2],[8,1,8,2],[7,1,7,2],[55,1,56,2],[8,4,8,5],[21,1,21,2],[9,1,9,2],[9,4,9,5],[10,1,10,2],[11,1,11,3],[12,1,12,3],[17,1,17,2],[18,1,18,2],[19,1,19,2],[20,1,20,2],[55,3,56,3],[16,1,16,2],[33,1,33,2],[34,1,34,2],[27,1,27,2],[28,1,28,2],[29,1,29,2],[30,1,30,2],[31,1,31,2],[32,1,32,2],[35,1,35,2],[36,1,36,2],[37,1,37,2],[38,1,38,2],[39,1,39,2]]}
[]
[null,null,"Budget/Regnskab for sporskiftepakken"]
[]
[null,null,"Oplysninger om medarbejderen"]
[]
[null,null,"Medarbejder 26"]
[null,"Medarbejderens lønkompensation fra sporskifte (kr./t.)",null,{"$f":"IF(D8>261,(IF(D11=\"Ja\",260-'Format ark'!D13,260)),IF(D8<=260,IF(D11=\"Ja\",IF(D8<'Format ark'!D13,0,D8-'Format ark'!D13),D8)))","v":0}]
[null,"Medarbejderens timesats (kr./t.)"]
[null,"Medarbejderens højst gennemførte uddannelse",null,null,{"$f":"IF(D9=\"\",\"Husk at vælge medarbejderens højst gennemførte uddannelse.\",\" \")","v":"Husk at vælge medarbejderens højst gennemførte uddannelse."}]
[null,"Har medarbejderen brugt sin uddannelse de senest 5 år?",null,null,{"$f":"IF(D10=\"\",\"Husk at svare på spørgsmålet.\",\" \")","v":"Husk at svare på spørgsmålet."}]
[null,"Medarbejder formodes at være berettiget til at få VEU-godtgørelse ",null,{"$f":"IF(OR(D9=\"Videregående uddannelse\",D9=\"Gymnasial uddannelse\")*AND(D10=\"ja\"),\"Nej\",\"Ja\")","v":"Ja"}]
[null,"Beskriv herunder hvad formålet med den planlagte sporskiftepakke er for medarbejderen:"]
[]
[]
[null,null,"Aktiviteter"]
[]
[null,"Afklaring, vejledning mv. \nSkriv navn på kursus",null,"Medarbejderens timeforbug (timer)","Evt. deltagerbetaling (kr.)","Giver kurset ret til VEU-godtgørelse?"]
[]
[]
[]
[]
[]
[null,"Samlet antal timer (udregner selv)",null,{"$f":"SUM(D18:D22)","v":0}]
[null,"Samlet lønkompensation udover evt. VEU-godtgørelse (udregner selv)",null,{"$f":"IF(D11=\"Nej\",D23*D7,0)+IF(AND(D11=\"Ja\",F18=\"Ja\"),D18*D7,0)+IF(AND(D11=\"Ja\",F19=\"Ja\"),D19*D7,0)+IF(AND(D11=\"Ja\",F20=\"Ja\"),D20*D7,0)+IF(AND(D11=\"Ja\",F21=\"Ja\"),D21*D7,0)+IF(AND(D11=\"Ja\",F22=\"Ja\"),D22*D7,0)+IF(AND(D11=\"Ja\",F18=\"Nej\"),D18*IF(D8>261,(IF(F18=\"Ja\",260-'Format ark'!D13,260)),IF(D8<=260,IF(F18=\"Ja\",D8-'Format ark'!D13,D8))),0)+IF(AND(D11=\"Ja\",F19=\"Nej\"),D19*IF(D8>261,(IF(F19=\"Ja\",260-'Format ark'!D13,260)),IF(D8<=260,IF(F19=\"Ja\",D8-'Format ark'!D13,D8))),0)+IF(AND(D11=\"Ja\",F20=\"Nej\"),D20*IF(D8>261,(IF(F20=\"Ja\",260-'Format ark'!D13,260)),IF(D8<=260,IF(F20=\"Ja\",D8-'Format ark'!D13,D8))),0)+IF(AND(D11=\"Ja\",F21=\"Nej\"),D21*IF(D8>261,(IF(F21=\"Ja\",260-'Format ark'!D13,260)),IF(D8<=260,IF(F21=\"Ja\",D8-'Format ark'!D13,D8))),0)+IF(AND(D11=\"Ja\",F22=\"Nej\"),D22*IF(D8>261,(IF(F22=\"Ja\",260-'Format ark'!D13,260)),IF(D8<=260,IF(F22=\"Ja\",D8-'Format ark'!D13,D8))),0)","v":0}]
[null,"Estimeret VEU-godtgørelse",null,{"$f":"IF(AND(D11=\"Ja\",F18=\"Ja\"),D18*'Format ark'!D13,0)+IF(AND(D11=\"Ja\",F19=\"Ja\"),D19*'Format ark'!D13,0)+IF(AND(D11=\"Ja\",F20=\"Ja\"),D20*'Format ark'!D13,0)+IF(AND(D11=\"Ja\",F21=\"Ja\"),D21*'Format ark'!D13,0)+IF(AND(D11=\"Ja\",F22=\"Ja\"),D22*'Format ark'!D13,0)","v":0}]
[null,"Samlet deltagerbeltaing (udregner selv)",null,{"$f":"SUM(E18:E22)","v":0}]
[]
[null,"Erhversrettet efteruddannelse\nSkriv navn på efteruddannelse",null,"Medarbejderens timeforbrug (timer)","Evt. deltagerbetaling (kr.)","Giver kurset ret til VEU-godtgørelse?"]
[]
[]
[]
[]
[]
[]
[]
[]
[]
[]
[]
[null,"Kørsel/transport (angives som faktisk udgift)",null,null,null,"Nej"]
[null,"Samlet antal timer (udregner selv)",null,{"$f":"SUM(D29:D40)","v":0}]
[null,"Samlet lønkompensation udover evt. VEU-godtgørelse (udregner selv)",null,{"$f":"IF(D11=\"Nej\",D41*D7,0)+IF(AND(D11=\"Ja\",F29=\"Ja\"),D29*D7,0)+IF(AND(D11=\"Ja\",F30=\"Ja\"),D30*D7,0)+IF(AND(D11=\"Ja\",F31=\"Ja\"),D31*D7,0)+IF(AND(D11=\"Ja\",F32=\"Ja\"),D32*D7,0)+IF(AND(D11=\"Ja\",F33=\"Ja\"),D33*D7,0)+IF(AND(D11=\"Ja\",F34=\"Ja\"),D34*D7,0)+IF(AND(D11=\"Ja\",F35=\"Ja\"),D35*D7,0)+IF(AND(D11=\"Ja\",F36=\"Ja\"),D36*D7,0)+IF(AND(D11=\"Ja\",F37=\"Ja\"),D37*D7,0)+IF(AND(D11=\"Ja\",F38=\"Ja\"),D38*D7,0)+IF(AND(D11=\"Ja\",F39=\"Ja\"),D39*D7,0)+IF(AND(D11=\"Ja\",F40=\"Ja\"),D40*D7,0)+IF(AND(D11=\"Ja\",F29=\"Nej\"),D29* IF(D8>261,(IF(F29=\"Ja\",260-'Format ark'!D13,260)),IF(D8<=260,IF(F29=\"Ja\",D8-'Format ark'!D13,D8))),0)+IF(AND(D11=\"Ja\",F30=\"Nej\"),D30* IF(D8>261,(IF(F30=\"Ja\",260-'Format ark'!D13,260)),IF(D8<=260,IF(F30=\"Ja\",D8-'Format ark'!D13,D8))),0)+IF(AND(D11=\"Ja\",F31=\"Nej\"),D31* IF(D8>261,(IF(F31=\"Ja\",260-'Format ark'!D13,260)),IF(D8<=260,IF(F31=\"Ja\",D8-'Format ark'!D13,D8))),0)+IF(AND(D11=\"Ja\",F32=\"Nej\"),D32* IF(D8>261,(IF(F32=\"Ja\",260-'Format ark'!D13,260)),IF(D8<=260,IF(F32=\"Ja\",D8-'Format ark'!D13,D8))),0)+IF(AND(D11=\"Ja\",F33=\"Nej\"),D33* IF(D8>261,(IF(F33=\"Ja\",260-'Format ark'!D13,260)),IF(D8<=260,IF(F33=\"Ja\",D8-'Format ark'!D13,D8))),0)+IF(AND(D11=\"Ja\",F34=\"Nej\"),D34* IF(D8>261,(IF(F34=\"Ja\",260-'Format ark'!D13,260)),IF(D8<=260,IF(F34=\"Ja\",D8-'Format ark'!D13,D8))),0)+IF(AND(D11=\"Ja\",F35=\"Nej\"),D35* IF(D8>261,(IF(F35=\"Ja\",260-'Format ark'!D13,260)),IF(D8<=260,IF(F35=\"Ja\",D8-'Format ark'!D13,D8))),0)+IF(AND(D11=\"Ja\",F36=\"Nej\"),D36* IF(D8>261,(IF(F36=\"Ja\",260-'Format ark'!D13,260)),IF(D8<=260,IF(F36=\"Ja\",D8-'Format ark'!D13,D8))),0)+IF(AND(D11=\"Ja\",F37=\"Nej\"),D37* IF(D8>261,(IF(F37=\"Ja\",260-'Format ark'!D13,260)),IF(D8<=260,IF(F37=\"Ja\",D8-'Format ark'!D13,D8))),0)+IF(AND(D11=\"Ja\",F38=\"Nej\"),D38* IF(D8>261,(IF(F38=\"Ja\",260-'Format ark'!D13,260)),IF(D8<=260,IF(F38=\"Ja\",D8-'Format ark'!D13,D8))),0)+IF(AND(D11=\"Ja\",F39=\"Nej\"),D39* IF(D8>261,(IF(F39=\"Ja\",260-'Format ark'!D13,260)),IF(D8<=260,IF(F39=\"Ja\",D8-'Format ark'!D13,D8))),0)+IF(AND(D11=\"Ja\",F40=\"Nej\"),D40* IF(D8>261,(IF(F40=\"Ja\",260-'Format ark'!D13,260)),IF(D8<=260,IF(F40=\"Ja\",D8-'Format ark'!D13,D8))),0)","v":0}]
[null,"Estimeret VEU-godtgørelse",null,{"$f":"IF(AND(D11=\"Ja\",F29=\"Ja\"),D29*'Format ark'!D13,0)+IF(AND(D11=\"Ja\",F30=\"Ja\"),D30*'Format ark'!D13,0)+IF(AND(D11=\"Ja\",F31=\"Ja\"),D31*'Format ark'!D13,0)+IF(AND(D11=\"Ja\",F32=\"Ja\"),D32*('Format ark'!D13),0)+IF(AND(D11=\"Ja\",F33=\"Ja\"),D33*'Format ark'!D13,0)+IF(AND(D11=\"Ja\",F34=\"Ja\"),D34*'Format ark'!D13,0)+IF(AND(D11=\"Ja\",F35=\"Ja\"),D35*'Format ark'!D13,0)+IF(AND(D11=\"Ja\",F36=\"Ja\"),D36*'Format ark'!D13,0)+IF(AND(D11=\"Ja\",F37=\"Ja\"),D37*'Format ark'!D13,0)+IF(AND(D11=\"Ja\",F38=\"Ja\"),D38*'Format ark'!D13,0)+IF(AND(D11=\"Ja\",F39=\"Ja\"),D39*'Format ark'!D13,0)+IF(AND(D11=\"Ja\",F40=\"Ja\"),D40*'Format ark'!D13,0)","v":0}]
[null,"Samlet deltagerbetaling (udregner selv)",null,{"$f":"SUM(E29:E40)","v":0}]
[]
[null,"Praktik"]
[null,"Navn på virksomhed og p-nummer"]
[null,"Medarbejderens timeforbrug",null,null,{"$f":"IF(D48>C51*0.5,\"Praktik må maksimalt udgøre 50% af det samlede tidsforbrug.\",\" \")","v":" "}]
[null,"Samlet lønkompensation for praktikopholdet",null,{"$f":"IF(D48>C51*0.5,\"IKKE MULIGT\",D48*(IF(D8>261,260,D8)))","v":0}]
[]
[null,"Samlet tidsforbrug ",{"$f":"IF(D48+D41+D23>300,\"IKKE MULIGT\",D48+D41+D23)","v":0},{"$f":"IF(C51>300,\"Det maksimale tidsforbrug er 300 timer\",\" \")","v":" "}]
[]
[null,"Tidsforbrug til administration","Antal timer","Beløb"]
[null,"Der kan godtgøres op til 5 timer.",null,{"$f":"IF(C54>5,\"Der kan maksimalt godtgøres 5 timer pr. medarbejder.\",C54*260)","v":0}]
[]
[null,"Samlet tilsagnsramme i kr. (maksimal støtte til sporskiftepakken): ",null,{"$f":"IF(C51>300,0,MIN(D49+D44+D42+D26+D24+D54,120000))","v":0},{"$f":"IF(D56=120000,\"Det maksimale tilsagn pr. sporskiftepakke er nået, og det overstigende beløb er derfor selvbetaling.\",\"\")","v":""}]
[]
[]
[null,"Estimeret VEU-godtgørelse",null,{"$f":"D43+D25","v":0}]
[]
[null,"Selvbetaling i kr. (udgifter udover den øvre tilsagnsramme)",null,{"$f":"IF(C51>300,0,IF(D56=120000,D44+D26+D42+D49+D24+D54-120000,0))","v":0}]

{"sheet":"Medarbejder 27","index":27,"n_rows":61,"n_cols":6,"rows_kept":61,"cut":false,"hidden":true,"merged":[[6,1,6,2],[8,1,8,2],[7,1,7,2],[55,1,56,2],[8,4,8,5],[21,1,21,2],[9,1,9,2],[9,4,9,5],[10,1,10,2],[11,1,11,3],[12,1,12,3],[17,1,17,2],[18,1,18,2],[19,1,19,2],[20,1,20,2],[55,3,56,3],[16,1,16,2],[33,1,33,2],[34,1,34,2],[27,1,27,2],[28,1,28,2],[29,1,29,2],[30,1,30,2],[31,1,31,2],[32,1,32,2],[35,1,35,2],[36,1,36,2],[37,1,37,2],[38,1,38,2],[39,1,39,2]]}
[]
[null,null,"Budget/Regnskab for sporskiftepakken"]
[]
[null,null,"Oplysninger om medarbejderen"]
[]
[null,null,"Medarbejder 27"]
[null,"Medarbejderens lønkompensation fra sporskifte (kr./t.)",null,{"$f":"IF(D8>261,(IF(D11=\"Ja\",260-'Format ark'!D13,260)),IF(D8<=260,IF(D11=\"Ja\",IF(D8<'Format ark'!D13,0,D8-'Format ark'!D13),D8)))","v":0}]
[null,"Medarbejderens timesats (kr./t.)"]
[null,"Medarbejderens højst gennemførte uddannelse",null,null,{"$f":"IF(D9=\"\",\"Husk at vælge medarbejderens højst gennemførte uddannelse.\",\" \")","v":"Husk at vælge medarbejderens højst gennemførte uddannelse."}]
[null,"Har medarbejderen brugt sin uddannelse de senest 5 år?",null,null,{"$f":"IF(D10=\"\",\"Husk at svare på spørgsmålet.\",\" \")","v":"Husk at svare på spørgsmålet."}]
[null,"Medarbejder formodes at være berettiget til at få VEU-godtgørelse ",null,{"$f":"IF(OR(D9=\"Videregående uddannelse\",D9=\"Gymnasial uddannelse\")*AND(D10=\"ja\"),\"Nej\",\"Ja\")","v":"Ja"}]
[null,"Beskriv herunder hvad formålet med den planlagte sporskiftepakke er for medarbejderen:"]
[]
[]
[null,null,"Aktiviteter"]
[]
[null,"Afklaring, vejledning mv. \nSkriv navn på kursus",null,"Medarbejderens timeforbug (timer)","Evt. deltagerbetaling (kr.)","Giver kurset ret til VEU-godtgørelse?"]
[]
[]
[]
[]
[]
[null,"Samlet antal timer (udregner selv)",null,{"$f":"SUM(D18:D22)","v":0}]
[null,"Samlet lønkompensation udover evt. VEU-godtgørelse (udregner selv)",null,{"$f":"IF(D11=\"Nej\",D23*D7,0)+IF(AND(D11=\"Ja\",F18=\"Ja\"),D18*D7,0)+IF(AND(D11=\"Ja\",F19=\"Ja\"),D19*D7,0)+IF(AND(D11=\"Ja\",F20=\"Ja\"),D20*D7,0)+IF(AND(D11=\"Ja\",F21=\"Ja\"),D21*D7,0)+IF(AND(D11=\"Ja\",F22=\"Ja\"),D22*D7,0)+IF(AND(D11=\"Ja\",F18=\"Nej\"),D18*IF(D8>261,(IF(F18=\"Ja\",260-'Format ark'!D13,260)),IF(D8<=260,IF(F18=\"Ja\",D8-'Format ark'!D13,D8))),0)+IF(AND(D11=\"Ja\",F19=\"Nej\"),D19*IF(D8>261,(IF(F19=\"Ja\",260-'Format ark'!D13,260)),IF(D8<=260,IF(F19=\"Ja\",D8-'Format ark'!D13,D8))),0)+IF(AND(D11=\"Ja\",F20=\"Nej\"),D20*IF(D8>261,(IF(F20=\"Ja\",260-'Format ark'!D13,260)),IF(D8<=260,IF(F20=\"Ja\",D8-'Format ark'!D13,D8))),0)+IF(AND(D11=\"Ja\",F21=\"Nej\"),D21*IF(D8>261,(IF(F21=\"Ja\",260-'Format ark'!D13,260)),IF(D8<=260,IF(F21=\"Ja\",D8-'Format ark'!D13,D8))),0)+IF(AND(D11=\"Ja\",F22=\"Nej\"),D22*IF(D8>261,(IF(F22=\"Ja\",260-'Format ark'!D13,260)),IF(D8<=260,IF(F22=\"Ja\",D8-'Format ark'!D13,D8))),0)","v":0}]
[null,"Estimeret VEU-godtgørelse",null,{"$f":"IF(AND(D11=\"Ja\",F18=\"Ja\"),D18*'Format ark'!D13,0)+IF(AND(D11=\"Ja\",F19=\"Ja\"),D19*'Format ark'!D13,0)+IF(AND(D11=\"Ja\",F20=\"Ja\"),D20*'Format ark'!D13,0)+IF(AND(D11=\"Ja\",F21=\"Ja\"),D21*'Format ark'!D13,0)+IF(AND(D11=\"Ja\",F22=\"Ja\"),D22*'Format ark'!D13,0)","v":0}]
[null,"Samlet deltagerbeltaing (udregner selv)",null,{"$f":"SUM(E18:E22)","v":0}]
[]
[null,"Erhversrettet efteruddannelse\nSkriv navn på efteruddannelse",null,"Medarbejderens timeforbrug (timer)","Evt. deltagerbetaling (kr.)","Giver kurset ret til VEU-godtgørelse?"]
[]
[]
[]
[]
[]
[]
[]
[]
[]
[]
[]
[null,"Kørsel/transport (angives som faktisk udgift)",null,null,null,"Nej"]
[null,"Samlet antal timer (udregner selv)",null,{"$f":"SUM(D29:D40)","v":0}]
[null,"Samlet lønkompensation udover evt. VEU-godtgørelse (udregner selv)",null,{"$f":"IF(D11=\"Nej\",D41*D7,0)+IF(AND(D11=\"Ja\",F29=\"Ja\"),D29*D7,0)+IF(AND(D11=\"Ja\",F30=\"Ja\"),D30*D7,0)+IF(AND(D11=\"Ja\",F31=\"Ja\"),D31*D7,0)+IF(AND(D11=\"Ja\",F32=\"Ja\"),D32*D7,0)+IF(AND(D11=\"Ja\",F33=\"Ja\"),D33*D7,0)+IF(AND(D11=\"Ja\",F34=\"Ja\"),D34*D7,0)+IF(AND(D11=\"Ja\",F35=\"Ja\"),D35*D7,0)+IF(AND(D11=\"Ja\",F36=\"Ja\"),D36*D7,0)+IF(AND(D11=\"Ja\",F37=\"Ja\"),D37*D7,0)+IF(AND(D11=\"Ja\",F38=\"Ja\"),D38*D7,0)+IF(AND(D11=\"Ja\",F39=\"Ja\"),D39*D7,0)+IF(AND(D11=\"Ja\",F40=\"Ja\"),D40*D7,0)+IF(AND(D11=\"Ja\",F29=\"Nej\"),D29* IF(D8>261,(IF(F29=\"Ja\",260-'Format ark'!D13,260)),IF(D8<=260,IF(F29=\"Ja\",D8-'Format ark'!D13,D8))),0)+IF(AND(D11=\"Ja\",F30=\"Nej\"),D30* IF(D8>261,(IF(F30=\"Ja\",260-'Format ark'!D13,260)),IF(D8<=260,IF(F30=\"Ja\",D8-'Format ark'!D13,D8))),0)+IF(AND(D11=\"Ja\",F31=\"Nej\"),D31* IF(D8>261,(IF(F31=\"Ja\",260-'Format ark'!D13,260)),IF(D8<=260,IF(F31=\"Ja\",D8-'Format ark'!D13,D8))),0)+IF(AND(D11=\"Ja\",F32=\"Nej\"),D32* IF(D8>261,(IF(F32=\"Ja\",260-'Format ark'!D13,260)),IF(D8<=260,IF(F32=\"Ja\",D8-'Format ark'!D13,D8))),0)+IF(AND(D11=\"Ja\",F33=\"Nej\"),D33* IF(D8>261,(IF(F33=\"Ja\",260-'Format ark'!D13,260)),IF(D8<=260,IF(F33=\"Ja\",D8-'Format ark'!D13,D8))),0)+IF(AND(D11=\"Ja\",F34=\"Nej\"),D34* IF(D8>261,(IF(F34=\"Ja\",260-'Format ark'!D13,260)),IF(D8<=260,IF(F34=\"Ja\",D8-'Format ark'!D13,D8))),0)+IF(AND(D11=\"Ja\",F35=\"Nej\"),D35* IF(D8>261,(IF(F35=\"Ja\",260-'Format ark'!D13,260)),IF(D8<=260,IF(F35=\"Ja\",D8-'Format ark'!D13,D8))),0)+IF(AND(D11=\"Ja\",F36=\"Nej\"),D36* IF(D8>261,(IF(F36=\"Ja\",260-'Format ark'!D13,260)),IF(D8<=260,IF(F36=\"Ja\",D8-'Format ark'!D13,D8))),0)+IF(AND(D11=\"Ja\",F37=\"Nej\"),D37* IF(D8>261,(IF(F37=\"Ja\",260-'Format ark'!D13,260)),IF(D8<=260,IF(F37=\"Ja\",D8-'Format ark'!D13,D8))),0)+IF(AND(D11=\"Ja\",F38=\"Nej\"),D38* IF(D8>261,(IF(F38=\"Ja\",260-'Format ark'!D13,260)),IF(D8<=260,IF(F38=\"Ja\",D8-'Format ark'!D13,D8))),0)+IF(AND(D11=\"Ja\",F39=\"Nej\"),D39* IF(D8>261,(IF(F39=\"Ja\",260-'Format ark'!D13,260)),IF(D8<=260,IF(F39=\"Ja\",D8-'Format ark'!D13,D8))),0)+IF(AND(D11=\"Ja\",F40=\"Nej\"),D40* IF(D8>261,(IF(F40=\"Ja\",260-'Format ark'!D13,260)),IF(D8<=260,IF(F40=\"Ja\",D8-'Format ark'!D13,D8))),0)","v":0}]
[null,"Estimeret VEU-godtgørelse",null,{"$f":"IF(AND(D11=\"Ja\",F29=\"Ja\"),D29*'Format ark'!D13,0)+IF(AND(D11=\"Ja\",F30=\"Ja\"),D30*'Format ark'!D13,0)+IF(AND(D11=\"Ja\",F31=\"Ja\"),D31*'Format ark'!D13,0)+IF(AND(D11=\"Ja\",F32=\"Ja\"),D32*('Format ark'!D13),0)+IF(AND(D11=\"Ja\",F33=\"Ja\"),D33*'Format ark'!D13,0)+IF(AND(D11=\"Ja\",F34=\"Ja\"),D34*'Format ark'!D13,0)+IF(AND(D11=\"Ja\",F35=\"Ja\"),D35*'Format ark'!D13,0)+IF(AND(D11=\"Ja\",F36=\"Ja\"),D36*'Format ark'!D13,0)+IF(AND(D11=\"Ja\",F37=\"Ja\"),D37*'Format ark'!D13,0)+IF(AND(D11=\"Ja\",F38=\"Ja\"),D38*'Format ark'!D13,0)+IF(AND(D11=\"Ja\",F39=\"Ja\"),D39*'Format ark'!D13,0)+IF(AND(D11=\"Ja\",F40=\"Ja\"),D40*'Format ark'!D13,0)","v":0}]
[null,"Samlet deltagerbetaling (udregner selv)",null,{"$f":"SUM(E29:E40)","v":0}]
[]
[null,"Praktik"]
[null,"Navn på virksomhed og p-nummer"]
[null,"Medarbejderens timeforbrug",null,null,{"$f":"IF(D48>C51*0.5,\"Praktik må maksimalt udgøre 50% af det samlede tidsforbrug.\",\" \")","v":" "}]
[null,"Samlet lønkompensation for praktikopholdet",null,{"$f":"IF(D48>C51*0.5,\"IKKE MULIGT\",D48*(IF(D8>261,260,D8)))","v":0}]
[]
[null,"Samlet tidsforbrug ",{"$f":"IF(D48+D41+D23>300,\"IKKE MULIGT\",D48+D41+D23)","v":0},{"$f":"IF(C51>300,\"Det maksimale tidsforbrug er 300 timer\",\" \")","v":" "}]
[]
[null,"Tidsforbrug til administration","Antal timer","Beløb"]
[null,"Der kan godtgøres op til 5 timer.",null,{"$f":"IF(C54>5,\"Der kan maksimalt godtgøres 5 timer pr. medarbejder.\",C54*260)","v":0}]
[]
[null,"Samlet tilsagnsramme i kr. (maksimal støtte til sporskiftepakken): ",null,{"$f":"IF(C51>300,0,MIN(D49+D44+D42+D26+D24+D54,120000))","v":0},{"$f":"IF(D56=120000,\"Det maksimale tilsagn pr. sporskiftepakke er nået, og det overstigende beløb er derfor selvbetaling.\",\"\")","v":""}]
[]
[]
[null,"Estimeret VEU-godtgørelse",null,{"$f":"D43+D25","v":0}]
[]
[null,"Selvbetaling i kr. (udgifter udover den øvre tilsagnsramme)",null,{"$f":"IF(C51>300,0,IF(D56=120000,D44+D26+D42+D49+D24+D54-120000,0))","v":0}]

{"sheet":"Medarbejder 28","index":28,"n_rows":61,"n_cols":6,"rows_kept":61,"cut":false,"hidden":true,"merged":[[6,1,6,2],[8,1,8,2],[7,1,7,2],[55,1,56,2],[8,4,8,5],[21,1,21,2],[9,1,9,2],[9,4,9,5],[10,1,10,2],[11,1,11,3],[12,1,12,3],[17,1,17,2],[18,1,18,2],[19,1,19,2],[20,1,20,2],[55,3,56,3],[16,1,16,2],[33,1,33,2],[34,1,34,2],[27,1,27,2],[28,1,28,2],[29,1,29,2],[30,1,30,2],[31,1,31,2],[32,1,32,2],[35,1,35,2],[36,1,36,2],[37,1,37,2],[38,1,38,2],[39,1,39,2]]}
[]
[null,null,"Budget/Regnskab for sporskiftepakken"]
[]
[null,null,"Oplysninger om medarbejderen"]
[]
[null,null,"Medarbejder 28"]
[null,"Medarbejderens lønkompensation fra sporskifte (kr./t.)",null,{"$f":"IF(D8>261,(IF(D11=\"Ja\",260-'Format ark'!D13,260)),IF(D8<=260,IF(D11=\"Ja\",IF(D8<'Format ark'!D13,0,D8-'Format ark'!D13),D8)))","v":0}]
[null,"Medarbejderens timesats (kr./t.)"]
[null,"Medarbejderens højst gennemførte uddannelse",null,null,{"$f":"IF(D9=\"\",\"Husk at vælge medarbejderens højst gennemførte uddannelse.\",\" \")","v":"Husk at vælge medarbejderens højst gennemførte uddannelse."}]
[null,"Har medarbejderen brugt sin uddannelse de senest 5 år?",null,null,{"$f":"IF(D10=\"\",\"Husk at svare på spørgsmålet.\",\" \")","v":"Husk at svare på spørgsmålet."}]
[null,"Medarbejder formodes at være berettiget til at få VEU-godtgørelse ",null,{"$f":"IF(OR(D9=\"Videregående uddannelse\",D9=\"Gymnasial uddannelse\")*AND(D10=\"ja\"),\"Nej\",\"Ja\")","v":"Ja"}]
[null,"Beskriv herunder hvad formålet med den planlagte sporskiftepakke er for medarbejderen:"]
[]
[]
[null,null,"Aktiviteter"]
[]
[null,"Afklaring, vejledning mv. \nSkriv navn på kursus",null,"Medarbejderens timeforbug (timer)","Evt. deltagerbetaling (kr.)","Giver kurset ret til VEU-godtgørelse?"]
[]
[]
[]
[]
[]
[null,"Samlet antal timer (udregner selv)",null,{"$f":"SUM(D18:D22)","v":0}]
[null,"Samlet lønkompensation udover evt. VEU-godtgørelse (udregner selv)",null,{"$f":"IF(D11=\"Nej\",D23*D7,0)+IF(AND(D11=\"Ja\",F18=\"Ja\"),D18*D7,0)+IF(AND(D11=\"Ja\",F19=\"Ja\"),D19*D7,0)+IF(AND(D11=\"Ja\",F20=\"Ja\"),D20*D7,0)+IF(AND(D11=\"Ja\",F21=\"Ja\"),D21*D7,0)+IF(AND(D11=\"Ja\",F22=\"Ja\"),D22*D7,0)+IF(AND(D11=\"Ja\",F18=\"Nej\"),D18*IF(D8>261,(IF(F18=\"Ja\",260-'Format ark'!D13,260)),IF(D8<=260,IF(F18=\"Ja\",D8-'Format ark'!D13,D8))),0)+IF(AND(D11=\"Ja\",F19=\"Nej\"),D19*IF(D8>261,(IF(F19=\"Ja\",260-'Format ark'!D13,260)),IF(D8<=260,IF(F19=\"Ja\",D8-'Format ark'!D13,D8))),0)+IF(AND(D11=\"Ja\",F20=\"Nej\"),D20*IF(D8>261,(IF(F20=\"Ja\",260-'Format ark'!D13,260)),IF(D8<=260,IF(F20=\"Ja\",D8-'Format ark'!D13,D8))),0)+IF(AND(D11=\"Ja\",F21=\"Nej\"),D21*IF(D8>261,(IF(F21=\"Ja\",260-'Format ark'!D13,260)),IF(D8<=260,IF(F21=\"Ja\",D8-'Format ark'!D13,D8))),0)+IF(AND(D11=\"Ja\",F22=\"Nej\"),D22*IF(D8>261,(IF(F22=\"Ja\",260-'Format ark'!D13,260)),IF(D8<=260,IF(F22=\"Ja\",D8-'Format ark'!D13,D8))),0)","v":0}]
[null,"Estimeret VEU-godtgørelse",null,{"$f":"IF(AND(D11=\"Ja\",F18=\"Ja\"),D18*'Format ark'!D13,0)+IF(AND(D11=\"Ja\",F19=\"Ja\"),D19*'Format ark'!D13,0)+IF(AND(D11=\"Ja\",F20=\"Ja\"),D20*'Format ark'!D13,0)+IF(AND(D11=\"Ja\",F21=\"Ja\"),D21*'Format ark'!D13,0)+IF(AND(D11=\"Ja\",F22=\"Ja\"),D22*'Format ark'!D13,0)","v":0}]
[null,"Samlet deltagerbeltaing (udregner selv)",null,{"$f":"SUM(E18:E22)","v":0}]
[]
[null,"Erhversrettet efteruddannelse\nSkriv navn på efteruddannelse",null,"Medarbejderens timeforbrug (timer)","Evt. deltagerbetaling (kr.)","Giver kurset ret til VEU-godtgørelse?"]
[]
[]
[]
[]
[]
[]
[]
[]
[]
[]
[]
[null,"Kørsel/transport (angives som faktisk udgift)",null,null,null,"Nej"]
[null,"Samlet antal timer (udregner selv)",null,{"$f":"SUM(D29:D40)","v":0}]
[null,"Samlet lønkompensation udover evt. VEU-godtgørelse (udregner selv)",null,{"$f":"IF(D11=\"Nej\",D41*D7,0)+IF(AND(D11=\"Ja\",F29=\"Ja\"),D29*D7,0)+IF(AND(D11=\"Ja\",F30=\"Ja\"),D30*D7,0)+IF(AND(D11=\"Ja\",F31=\"Ja\"),D31*D7,0)+IF(AND(D11=\"Ja\",F32=\"Ja\"),D32*D7,0)+IF(AND(D11=\"Ja\",F33=\"Ja\"),D33*D7,0)+IF(AND(D11=\"Ja\",F34=\"Ja\"),D34*D7,0)+IF(AND(D11=\"Ja\",F35=\"Ja\"),D35*D7,0)+IF(AND(D11=\"Ja\",F36=\"Ja\"),D36*D7,0)+IF(AND(D11=\"Ja\",F37=\"Ja\"),D37*D7,0)+IF(AND(D11=\"Ja\",F38=\"Ja\"),D38*D7,0)+IF(AND(D11=\"Ja\",F39=\"Ja\"),D39*D7,0)+IF(AND(D11=\"Ja\",F40=\"Ja\"),D40*D7,0)+IF(AND(D11=\"Ja\",F29=\"Nej\"),D29* IF(D8>261,(IF(F29=\"Ja\",260-'Format ark'!D13,260)),IF(D8<=260,IF(F29=\"Ja\",D8-'Format ark'!D13,D8))),0)+IF(AND(D11=\"Ja\",F30=\"Nej\"),D30* IF(D8>261,(IF(F30=\"Ja\",260-'Format ark'!D13,260)),IF(D8<=260,IF(F30=\"Ja\",D8-'Format ark'!D13,D8))),0)+IF(AND(D11=\"Ja\",F31=\"Nej\"),D31* IF(D8>261,(IF(F31=\"Ja\",260-'Format ark'!D13,260)),IF(D8<=260,IF(F31=\"Ja\",D8-'Format ark'!D13,D8))),0)+IF(AND(D11=\"Ja\",F32=\"Nej\"),D32* IF(D8>261,(IF(F32=\"Ja\",260-'Format ark'!D13,260)),IF(D8<=260,IF(F32=\"Ja\",D8-'Format ark'!D13,D8))),0)+IF(AND(D11=\"Ja\",F33=\"Nej\"),D33* IF(D8>261,(IF(F33=\"Ja\",260-'Format ark'!D13,260)),IF(D8<=260,IF(F33=\"Ja\",D8-'Format ark'!D13,D8))),0)+IF(AND(D11=\"Ja\",F34=\"Nej\"),D34* IF(D8>261,(IF(F34=\"Ja\",260-'Format ark'!D13,260)),IF(D8<=260,IF(F34=\"Ja\",D8-'Format ark'!D13,D8))),0)+IF(AND(D11=\"Ja\",F35=\"Nej\"),D35* IF(D8>261,(IF(F35=\"Ja\",260-'Format ark'!D13,260)),IF(D8<=260,IF(F35=\"Ja\",D8-'Format ark'!D13,D8))),0)+IF(AND(D11=\"Ja\",F36=\"Nej\"),D36* IF(D8>261,(IF(F36=\"Ja\",260-'Format ark'!D13,260)),IF(D8<=260,IF(F36=\"Ja\",D8-'Format ark'!D13,D8))),0)+IF(AND(D11=\"Ja\",F37=\"Nej\"),D37* IF(D8>261,(IF(F37=\"Ja\",260-'Format ark'!D13,260)),IF(D8<=260,IF(F37=\"Ja\",D8-'Format ark'!D13,D8))),0)+IF(AND(D11=\"Ja\",F38=\"Nej\"),D38* IF(D8>261,(IF(F38=\"Ja\",260-'Format ark'!D13,260)),IF(D8<=260,IF(F38=\"Ja\",D8-'Format ark'!D13,D8))),0)+IF(AND(D11=\"Ja\",F39=\"Nej\"),D39* IF(D8>261,(IF(F39=\"Ja\",260-'Format ark'!D13,260)),IF(D8<=260,IF(F39=\"Ja\",D8-'Format ark'!D13,D8))),0)+IF(AND(D11=\"Ja\",F40=\"Nej\"),D40* IF(D8>261,(IF(F40=\"Ja\",260-'Format ark'!D13,260)),IF(D8<=260,IF(F40=\"Ja\",D8-'Format ark'!D13,D8))),0)","v":0}]
[null,"Estimeret VEU-godtgørelse",null,{"$f":"IF(AND(D11=\"Ja\",F29=\"Ja\"),D29*'Format ark'!D13,0)+IF(AND(D11=\"Ja\",F30=\"Ja\"),D30*'Format ark'!D13,0)+IF(AND(D11=\"Ja\",F31=\"Ja\"),D31*'Format ark'!D13,0)+IF(AND(D11=\"Ja\",F32=\"Ja\"),D32*('Format ark'!D13),0)+IF(AND(D11=\"Ja\",F33=\"Ja\"),D33*'Format ark'!D13,0)+IF(AND(D11=\"Ja\",F34=\"Ja\"),D34*'Format ark'!D13,0)+IF(AND(D11=\"Ja\",F35=\"Ja\"),D35*'Format ark'!D13,0)+IF(AND(D11=\"Ja\",F36=\"Ja\"),D36*'Format ark'!D13,0)+IF(AND(D11=\"Ja\",F37=\"Ja\"),D37*'Format ark'!D13,0)+IF(AND(D11=\"Ja\",F38=\"Ja\"),D38*'Format ark'!D13,0)+IF(AND(D11=\"Ja\",F39=\"Ja\"),D39*'Format ark'!D13,0)+IF(AND(D11=\"Ja\",F40=\"Ja\"),D40*'Format ark'!D13,0)","v":0}]
[null,"Samlet deltagerbetaling (udregner selv)",null,{"$f":"SUM(E29:E40)","v":0}]
[]
[null,"Praktik"]
[null,"Navn på virksomhed og p-nummer"]
[null,"Medarbejderens timeforbrug",null,null,{"$f":"IF(D48>C51*0.5,\"Praktik må maksimalt udgøre 50% af det samlede tidsforbrug.\",\" \")","v":" "}]
[null,"Samlet lønkompensation for praktikopholdet",null,{"$f":"IF(D48>C51*0.5,\"IKKE MULIGT\",D48*(IF(D8>261,260,D8)))","v":0}]
[]
[null,"Samlet tidsforbrug ",{"$f":"IF(D48+D41+D23>300,\"IKKE MULIGT\",D48+D41+D23)","v":0},{"$f":"IF(C51>300,\"Det maksimale tidsforbrug er 300 timer\",\" \")","v":" "}]
[]
[null,"Tidsforbrug til administration","Antal timer","Beløb"]
[null,"Der kan godtgøres op til 5 timer.",null,{"$f":"IF(C54>5,\"Der kan maksimalt godtgøres 5 timer pr. medarbejder.\",C54*260)","v":0}]
[]
[null,"Samlet tilsagnsramme i kr. (maksimal støtte til sporskiftepakken): ",null,{"$f":"IF(C51>300,0,MIN(D49+D44+D42+D26+D24+D54,120000))","v":0},{"$f":"IF(D56=120000,\"Det maksimale tilsagn pr. sporskiftepakke er nået, og det overstigende beløb er derfor selvbetaling.\",\"\")","v":""}]
[]
[]
[null,"Estimeret VEU-godtgørelse",null,{"$f":"D43+D25","v":0}]
[]
[null,"Selvbetaling i kr. (udgifter udover den øvre tilsagnsramme)",null,{"$f":"IF(C51>300,0,IF(D56=120000,D44+D26+D42+D49+D24+D54-120000,0))","v":0}]

{"sheet":"Medarbejder 29","index":29,"n_rows":61,"n_cols":10,"rows_kept":61,"cut":false,"hidden":true,"merged":[[6,1,6,2],[8,1,8,2],[7,1,7,2],[55,1,56,2],[8,4,8,5],[21,1,21,2],[9,1,9,2],[9,4,9,5],[10,1,10,2],[11,1,11,3],[12,1,12,3],[17,1,17,2],[18,1,18,2],[19,1,19,2],[20,1,20,2],[55,3,56,3],[16,1,16,2],[33,1,33,2],[34,1,34,2],[27,1,27,2],[28,1,28,2],[29,1,29,2],[30,1,30,2],[31,1,31,2],[32,1,32,2],[35,1,35,2],[36,1,36,2],[37,1,37,2],[38,1,38,2],[39,1,39,2]]}
[]
[null,null,"Budget/Regnskab for sporskiftepakken"]
[]
[null,null,"Oplysninger om medarbejderen"]
[]
[null,null,"Medarbejder 29",null,null,null,null,null,null,{"$f":"$D$4+$C$3","v":0}]
[null,"Medarbejderens lønkompensation fra sporskifte (kr./t.)",null,{"$f":"IF(D8>261,(IF(D11=\"Ja\",260-'Format ark'!D13,260)),IF(D8<=260,IF(D11=\"Ja\",IF(D8<'Format ark'!D13,0,D8-'Format ark'!D13),D8)))","v":0}]
[null,"Medarbejderens timesats (kr./t.)"]
[null,"Medarbejderens højst gennemførte uddannelse",null,null,{"$f":"IF(D9=\"\",\"Husk at vælge medarbejderens højst gennemførte uddannelse.\",\" \")","v":"Husk at vælge medarbejderens højst gennemførte uddannelse."}]
[null,"Har medarbejderen brugt sin uddannelse de senest 5 år?",null,null,{"$f":"IF(D10=\"\",\"Husk at svare på spørgsmålet.\",\" \")","v":"Husk at svare på spørgsmålet."}]
[null,"Medarbejder formodes at være berettiget til at få VEU-godtgørelse ",null,{"$f":"IF(OR(D9=\"Videregående uddannelse\",D9=\"Gymnasial uddannelse\")*AND(D10=\"ja\"),\"Nej\",\"Ja\")","v":"Ja"}]
[null,"Beskriv herunder hvad formålet med den planlagte sporskiftepakke er for medarbejderen:"]
[]
[]
[null,null,"Aktiviteter"]
[]
[null,"Afklaring, vejledning mv. \nSkriv navn på kursus",null,"Medarbejderens timeforbug (timer)","Evt. deltagerbetaling (kr.)","Giver kurset ret til VEU-godtgørelse?"]
[]
[]
[]
[]
[]
[null,"Samlet antal timer (udregner selv)",null,{"$f":"SUM(D18:D22)","v":0}]
[null,"Samlet lønkompensation udover evt. VEU-godtgørelse (udregner selv)",null,{"$f":"IF(D11=\"Nej\",D23*D7,0)+IF(AND(D11=\"Ja\",F18=\"Ja\"),D18*D7,0)+IF(AND(D11=\"Ja\",F19=\"Ja\"),D19*D7,0)+IF(AND(D11=\"Ja\",F20=\"Ja\"),D20*D7,0)+IF(AND(D11=\"Ja\",F21=\"Ja\"),D21*D7,0)+IF(AND(D11=\"Ja\",F22=\"Ja\"),D22*D7,0)+IF(AND(D11=\"Ja\",F18=\"Nej\"),D18*IF(D8>261,(IF(F18=\"Ja\",260-'Format ark'!D13,260)),IF(D8<=260,IF(F18=\"Ja\",D8-'Format ark'!D13,D8))),0)+IF(AND(D11=\"Ja\",F19=\"Nej\"),D19*IF(D8>261,(IF(F19=\"Ja\",260-'Format ark'!D13,260)),IF(D8<=260,IF(F19=\"Ja\",D8-'Format ark'!D13,D8))),0)+IF(AND(D11=\"Ja\",F20=\"Nej\"),D20*IF(D8>261,(IF(F20=\"Ja\",260-'Format ark'!D13,260)),IF(D8<=260,IF(F20=\"Ja\",D8-'Format ark'!D13,D8))),0)+IF(AND(D11=\"Ja\",F21=\"Nej\"),D21*IF(D8>261,(IF(F21=\"Ja\",260-'Format ark'!D13,260)),IF(D8<=260,IF(F21=\"Ja\",D8-'Format ark'!D13,D8))),0)+IF(AND(D11=\"Ja\",F22=\"Nej\"),D22*IF(D8>261,(IF(F22=\"Ja\",260-'Format ark'!D13,260)),IF(D8<=260,IF(F22=\"Ja\",D8-'Format ark'!D13,D8))),0)","v":0}]
[null,"Estimeret VEU-godtgørelse",null,{"$f":"IF(AND(D11=\"Ja\",F18=\"Ja\"),D18*'Format ark'!D13,0)+IF(AND(D11=\"Ja\",F19=\"Ja\"),D19*'Format ark'!D13,0)+IF(AND(D11=\"Ja\",F20=\"Ja\"),D20*'Format ark'!D13,0)+IF(AND(D11=\"Ja\",F21=\"Ja\"),D21*'Format ark'!D13,0)+IF(AND(D11=\"Ja\",F22=\"Ja\"),D22*'Format ark'!D13,0)","v":0}]
[null,"Samlet deltagerbeltaing (udregner selv)",null,{"$f":"SUM(E18:E22)","v":0}]
[]
[null,"Erhversrettet efteruddannelse\nSkriv navn på efteruddannelse",null,"Medarbejderens timeforbrug (timer)","Evt. deltagerbetaling (kr.)","Giver kurset ret til VEU-godtgørelse?"]
[]
[]
[]
[]
[]
[]
[]
[]
[]
[]
[]
[null,"Kørsel/transport (angives som faktisk udgift)",null,null,null,"Nej"]
[null,"Samlet antal timer (udregner selv)",null,{"$f":"SUM(D29:D40)","v":0}]
[null,"Samlet lønkompensation udover evt. VEU-godtgørelse (udregner selv)",null,{"$f":"IF(D11=\"Nej\",D41*D7,0)+IF(AND(D11=\"Ja\",F29=\"Ja\"),D29*D7,0)+IF(AND(D11=\"Ja\",F30=\"Ja\"),D30*D7,0)+IF(AND(D11=\"Ja\",F31=\"Ja\"),D31*D7,0)+IF(AND(D11=\"Ja\",F32=\"Ja\"),D32*D7,0)+IF(AND(D11=\"Ja\",F33=\"Ja\"),D33*D7,0)+IF(AND(D11=\"Ja\",F34=\"Ja\"),D34*D7,0)+IF(AND(D11=\"Ja\",F35=\"Ja\"),D35*D7,0)+IF(AND(D11=\"Ja\",F36=\"Ja\"),D36*D7,0)+IF(AND(D11=\"Ja\",F37=\"Ja\"),D37*D7,0)+IF(AND(D11=\"Ja\",F38=\"Ja\"),D38*D7,0)+IF(AND(D11=\"Ja\",F39=\"Ja\"),D39*D7,0)+IF(AND(D11=\"Ja\",F40=\"Ja\"),D40*D7,0)+IF(AND(D11=\"Ja\",F29=\"Nej\"),D29* IF(D8>261,(IF(F29=\"Ja\",260-'Format ark'!D13,260)),IF(D8<=260,IF(F29=\"Ja\",D8-'Format ark'!D13,D8))),0)+IF(AND(D11=\"Ja\",F30=\"Nej\"),D30* IF(D8>261,(IF(F30=\"Ja\",260-'Format ark'!D13,260)),IF(D8<=260,IF(F30=\"Ja\",D8-'Format ark'!D13,D8))),0)+IF(AND(D11=\"Ja\",F31=\"Nej\"),D31* IF(D8>261,(IF(F31=\"Ja\",260-'Format ark'!D13,260)),IF(D8<=260,IF(F31=\"Ja\",D8-'Format ark'!D13,D8))),0)+IF(AND(D11=\"Ja\",F32=\"Nej\"),D32* IF(D8>261,(IF(F32=\"Ja\",260-'Format ark'!D13,260)),IF(D8<=260,IF(F32=\"Ja\",D8-'Format ark'!D13,D8))),0)+IF(AND(D11=\"Ja\",F33=\"Nej\"),D33* IF(D8>261,(IF(F33=\"Ja\",260-'Format ark'!D13,260)),IF(D8<=260,IF(F33=\"Ja\",D8-'Format ark'!D13,D8))),0)+IF(AND(D11=\"Ja\",F34=\"Nej\"),D34* IF(D8>261,(IF(F34=\"Ja\",260-'Format ark'!D13,260)),IF(D8<=260,IF(F34=\"Ja\",D8-'Format ark'!D13,D8))),0)+IF(AND(D11=\"Ja\",F35=\"Nej\"),D35* IF(D8>261,(IF(F35=\"Ja\",260-'Format ark'!D13,260)),IF(D8<=260,IF(F35=\"Ja\",D8-'Format ark'!D13,D8))),0)+IF(AND(D11=\"Ja\",F36=\"Nej\"),D36* IF(D8>261,(IF(F36=\"Ja\",260-'Format ark'!D13,260)),IF(D8<=260,IF(F36=\"Ja\",D8-'Format ark'!D13,D8))),0)+IF(AND(D11=\"Ja\",F37=\"Nej\"),D37* IF(D8>261,(IF(F37=\"Ja\",260-'Format ark'!D13,260)),IF(D8<=260,IF(F37=\"Ja\",D8-'Format ark'!D13,D8))),0)+IF(AND(D11=\"Ja\",F38=\"Nej\"),D38* IF(D8>261,(IF(F38=\"Ja\",260-'Format ark'!D13,260)),IF(D8<=260,IF(F38=\"Ja\",D8-'Format ark'!D13,D8))),0)+IF(AND(D11=\"Ja\",F39=\"Nej\"),D39* IF(D8>261,(IF(F39=\"Ja\",260-'Format ark'!D13,260)),IF(D8<=260,IF(F39=\"Ja\",D8-'Format ark'!D13,D8))),0)+IF(AND(D11=\"Ja\",F40=\"Nej\"),D40* IF(D8>261,(IF(F40=\"Ja\",260-'Format ark'!D13,260)),IF(D8<=260,IF(F40=\"Ja\",D8-'Format ark'!D13,D8))),0)","v":0}]
[null,"Estimeret VEU-godtgørelse",null,{"$f":"IF(AND(D11=\"Ja\",F29=\"Ja\"),D29*'Format ark'!D13,0)+IF(AND(D11=\"Ja\",F30=\"Ja\"),D30*'Format ark'!D13,0)+IF(AND(D11=\"Ja\",F31=\"Ja\"),D31*'Format ark'!D13,0)+IF(AND(D11=\"Ja\",F32=\"Ja\"),D32*('Format ark'!D13),0)+IF(AND(D11=\"Ja\",F33=\"Ja\"),D33*'Format ark'!D13,0)+IF(AND(D11=\"Ja\",F34=\"Ja\"),D34*'Format ark'!D13,0)+IF(AND(D11=\"Ja\",F35=\"Ja\"),D35*'Format ark'!D13,0)+IF(AND(D11=\"Ja\",F36=\"Ja\"),D36*'Format ark'!D13,0)+IF(AND(D11=\"Ja\",F37=\"Ja\"),D37*'Format ark'!D13,0)+IF(AND(D11=\"Ja\",F38=\"Ja\"),D38*'Format ark'!D13,0)+IF(AND(D11=\"Ja\",F39=\"Ja\"),D39*'Format ark'!D13,0)+IF(AND(D11=\"Ja\",F40=\"Ja\"),D40*'Format ark'!D13,0)","v":0}]
[null,"Samlet deltagerbetaling (udregner selv)",null,{"$f":"SUM(E29:E40)","v":0}]
[]
[null,"Praktik"]
[null,"Navn på virksomhed og p-nummer"]
[null,"Medarbejderens timeforbrug",null,null,{"$f":"IF(D48>C51*0.5,\"Praktik må maksimalt udgøre 50% af det samlede tidsforbrug.\",\" \")","v":" "}]
[null,"Samlet lønkompensation for praktikopholdet",null,{"$f":"IF(D48>C51*0.5,\"IKKE MULIGT\",D48*(IF(D8>261,260,D8)))","v":0}]
[]
[null,"Samlet tidsforbrug ",{"$f":"IF(D48+D41+D23>300,\"IKKE MULIGT\",D48+D41+D23)","v":0},{"$f":"IF(C51>300,\"Det maksimale tidsforbrug er 300 timer\",\" \")","v":" "}]
[]
[null,"Tidsforbrug til administration","Antal timer","Beløb"]
[null,"Der kan godtgøres op til 5 timer.",null,{"$f":"IF(C54>5,\"Der kan maksimalt godtgøres 5 timer pr. medarbejder.\",C54*260)","v":0}]
[]
[null,"Samlet tilsagnsramme i kr. (maksimal støtte til sporskiftepakken): ",null,{"$f":"IF(C51>300,0,MIN(D49+D44+D42+D26+D24+D54,120000))","v":0},{"$f":"IF(D56=120000,\"Det maksimale tilsagn pr. sporskiftepakke er nået, og det overstigende beløb er derfor selvbetaling.\",\"\")","v":""}]
[]
[]
[null,"Estimeret VEU-godtgørelse",null,{"$f":"D43+D25","v":0}]
[]
[null,"Selvbetaling i kr. (udgifter udover den øvre tilsagnsramme)",null,{"$f":"IF(C51>300,0,IF(D56=120000,D44+D26+D42+D49+D24+D54-120000,0))","v":0}]

{"sheet":"Medarbejder 30","index":30,"n_rows":61,"n_cols":6,"rows_kept":61,"cut":false,"hidden":true,"merged":[[6,1,6,2],[8,1,8,2],[7,1,7,2],[55,1,56,2],[8,4,8,5],[21,1,21,2],[9,1,9,2],[9,4,9,5],[10,1,10,2],[11,1,11,3],[12,1,12,3],[17,1,17,2],[18,1,18,2],[19,1,19,2],[20,1,20,2],[55,3,56,3],[16,1,16,2],[33,1,33,2],[34,1,34,2],[27,1,27,2],[28,1,28,2],[29,1,29,2],[30,1,30,2],[31,1,31,2],[32,1,32,2],[35,1,35,2],[36,1,36,2],[37,1,37,2],[38,1,38,2],[39,1,39,2]]}
[]
[null,null,"Budget/Regnskab for sporskiftepakken"]
[]
[null,null,"Oplysninger om medarbejderen"]
[]
[null,null,"Medarbejder 30"]
[null,"Medarbejderens lønkompensation fra sporskifte (kr./t.)",null,{"$f":"IF(D8>261,(IF(D11=\"Ja\",260-'Format ark'!D13,260)),IF(D8<=260,IF(D11=\"Ja\",IF(D8<'Format ark'!D13,0,D8-'Format ark'!D13),D8)))","v":0}]
[null,"Medarbejderens timesats (kr./t.)"]
[null,"Medarbejderens højst gennemførte uddannelse",null,null,{"$f":"IF(D9=\"\",\"Husk at vælge medarbejderens højst gennemførte uddannelse.\",\" \")","v":"Husk at vælge medarbejderens højst gennemførte uddannelse."}]
[null,"Har medarbejderen brugt sin uddannelse de senest 5 år?",null,null,{"$f":"IF(D10=\"\",\"Husk at svare på spørgsmålet.\",\" \")","v":"Husk at svare på spørgsmålet."}]
[null,"Medarbejder formodes at være berettiget til at få VEU-godtgørelse ",null,{"$f":"IF(OR(D9=\"Videregående uddannelse\",D9=\"Gymnasial uddannelse\")*AND(D10=\"ja\"),\"Nej\",\"Ja\")","v":"Ja"}]
[null,"Beskriv herunder hvad formålet med den planlagte sporskiftepakke er for medarbejderen:"]
[]
[]
[null,null,"Aktiviteter"]
[]
[null,"Afklaring, vejledning mv. \nSkriv navn på kursus",null,"Medarbejderens timeforbug (timer)","Evt. deltagerbetaling (kr.)","Giver kurset ret til VEU-godtgørelse?"]
[]
[]
[]
[]
[]
[null,"Samlet antal timer (udregner selv)",null,{"$f":"SUM(D18:D22)","v":0}]
[null,"Samlet lønkompensation udover evt. VEU-godtgørelse (udregner selv)",null,{"$f":"IF(D11=\"Nej\",D23*D7,0)+IF(AND(D11=\"Ja\",F18=\"Ja\"),D18*D7,0)+IF(AND(D11=\"Ja\",F19=\"Ja\"),D19*D7,0)+IF(AND(D11=\"Ja\",F20=\"Ja\"),D20*D7,0)+IF(AND(D11=\"Ja\",F21=\"Ja\"),D21*D7,0)+IF(AND(D11=\"Ja\",F22=\"Ja\"),D22*D7,0)+IF(AND(D11=\"Ja\",F18=\"Nej\"),D18*IF(D8>261,(IF(F18=\"Ja\",260-'Format ark'!D13,260)),IF(D8<=260,IF(F18=\"Ja\",D8-'Format ark'!D13,D8))),0)+IF(AND(D11=\"Ja\",F19=\"Nej\"),D19*IF(D8>261,(IF(F19=\"Ja\",260-'Format ark'!D13,260)),IF(D8<=260,IF(F19=\"Ja\",D8-'Format ark'!D13,D8))),0)+IF(AND(D11=\"Ja\",F20=\"Nej\"),D20*IF(D8>261,(IF(F20=\"Ja\",260-'Format ark'!D13,260)),IF(D8<=260,IF(F20=\"Ja\",D8-'Format ark'!D13,D8))),0)+IF(AND(D11=\"Ja\",F21=\"Nej\"),D21*IF(D8>261,(IF(F21=\"Ja\",260-'Format ark'!D13,260)),IF(D8<=260,IF(F21=\"Ja\",D8-'Format ark'!D13,D8))),0)+IF(AND(D11=\"Ja\",F22=\"Nej\"),D22*IF(D8>261,(IF(F22=\"Ja\",260-'Format ark'!D13,260)),IF(D8<=260,IF(F22=\"Ja\",D8-'Format ark'!D13,D8))),0)","v":0}]
[null,"Estimeret VEU-godtgørelse",null,{"$f":"IF(AND(D11=\"Ja\",F18=\"Ja\"),D18*'Format ark'!D13,0)+IF(AND(D11=\"Ja\",F19=\"Ja\"),D19*'Format ark'!D13,0)+IF(AND(D11=\"Ja\",F20=\"Ja\"),D20*'Format ark'!D13,0)+IF(AND(D11=\"Ja\",F21=\"Ja\"),D21*'Format ark'!D13,0)+IF(AND(D11=\"Ja\",F22=\"Ja\"),D22*'Format ark'!D13,0)","v":0}]
[null,"Samlet deltagerbeltaing (udregner selv)",null,{"$f":"SUM(E18:E22)","v":0}]
[]
[null,"Erhversrettet efteruddannelse\nSkriv navn på efteruddannelse",null,"Medarbejderens timeforbrug (timer)","Evt. deltagerbetaling (kr.)","Giver kurset ret til VEU-godtgørelse?"]
[]
[]
[]
[]
[]
[]
[]
[]
[]
[]
[]
[null,"Kørsel/transport (angives som faktisk udgift)",null,null,null,"Nej"]
[null,"Samlet antal timer (udregner selv)",null,{"$f":"SUM(D29:D40)","v":0}]
[null,"Samlet lønkompensation udover evt. VEU-godtgørelse (udregner selv)",null,{"$f":"IF(D11=\"Nej\",D41*D7,0)+IF(AND(D11=\"Ja\",F29=\"Ja\"),D29*D7,0)+IF(AND(D11=\"Ja\",F30=\"Ja\"),D30*D7,0)+IF(AND(D11=\"Ja\",F31=\"Ja\"),D31*D7,0)+IF(AND(D11=\"Ja\",F32=\"Ja\"),D32*D7,0)+IF(AND(D11=\"Ja\",F33=\"Ja\"),D33*D7,0)+IF(AND(D11=\"Ja\",F34=\"Ja\"),D34*D7,0)+IF(AND(D11=\"Ja\",F35=\"Ja\"),D35*D7,0)+IF(AND(D11=\"Ja\",F36=\"Ja\"),D36*D7,0)+IF(AND(D11=\"Ja\",F37=\"Ja\"),D37*D7,0)+IF(AND(D11=\"Ja\",F38=\"Ja\"),D38*D7,0)+IF(AND(D11=\"Ja\",F39=\"Ja\"),D39*D7,0)+IF(AND(D11=\"Ja\",F40=\"Ja\"),D40*D7,0)+IF(AND(D11=\"Ja\",F29=\"Nej\"),D29* IF(D8>261,(IF(F29=\"Ja\",260-'Format ark'!D13,260)),IF(D8<=260,IF(F29=\"Ja\",D8-'Format ark'!D13,D8))),0)+IF(AND(D11=\"Ja\",F30=\"Nej\"),D30* IF(D8>261,(IF(F30=\"Ja\",260-'Format ark'!D13,260)),IF(D8<=260,IF(F30=\"Ja\",D8-'Format ark'!D13,D8))),0)+IF(AND(D11=\"Ja\",F31=\"Nej\"),D31* IF(D8>261,(IF(F31=\"Ja\",260-'Format ark'!D13,260)),IF(D8<=260,IF(F31=\"Ja\",D8-'Format ark'!D13,D8))),0)+IF(AND(D11=\"Ja\",F32=\"Nej\"),D32* IF(D8>261,(IF(F32=\"Ja\",260-'Format ark'!D13,260)),IF(D8<=260,IF(F32=\"Ja\",D8-'Format ark'!D13,D8))),0)+IF(AND(D11=\"Ja\",F33=\"Nej\"),D33* IF(D8>261,(IF(F33=\"Ja\",260-'Format ark'!D13,260)),IF(D8<=260,IF(F33=\"Ja\",D8-'Format ark'!D13,D8))),0)+IF(AND(D11=\"Ja\",F34=\"Nej\"),D34* IF(D8>261,(IF(F34=\"Ja\",260-'Format ark'!D13,260)),IF(D8<=260,IF(F34=\"Ja\",D8-'Format ark'!D13,D8))),0)+IF(AND(D11=\"Ja\",F35=\"Nej\"),D35* IF(D8>261,(IF(F35=\"Ja\",260-'Format ark'!D13,260)),IF(D8<=260,IF(F35=\"Ja\",D8-'Format ark'!D13,D8))),0)+IF(AND(D11=\"Ja\",F36=\"Nej\"),D36* IF(D8>261,(IF(F36=\"Ja\",260-'Format ark'!D13,260)),IF(D8<=260,IF(F36=\"Ja\",D8-'Format ark'!D13,D8))),0)+IF(AND(D11=\"Ja\",F37=\"Nej\"),D37* IF(D8>261,(IF(F37=\"Ja\",260-'Format ark'!D13,260)),IF(D8<=260,IF(F37=\"Ja\",D8-'Format ark'!D13,D8))),0)+IF(AND(D11=\"Ja\",F38=\"Nej\"),D38* IF(D8>261,(IF(F38=\"Ja\",260-'Format ark'!D13,260)),IF(D8<=260,IF(F38=\"Ja\",D8-'Format ark'!D13,D8))),0)+IF(AND(D11=\"Ja\",F39=\"Nej\"),D39* IF(D8>261,(IF(F39=\"Ja\",260-'Format ark'!D13,260)),IF(D8<=260,IF(F39=\"Ja\",D8-'Format ark'!D13,D8))),0)+IF(AND(D11=\"Ja\",F40=\"Nej\"),D40* IF(D8>261,(IF(F40=\"Ja\",260-'Format ark'!D13,260)),IF(D8<=260,IF(F40=\"Ja\",D8-'Format ark'!D13,D8))),0)","v":0}]
[null,"Estimeret VEU-godtgørelse",null,{"$f":"IF(AND(D11=\"Ja\",F29=\"Ja\"),D29*'Format ark'!D13,0)+IF(AND(D11=\"Ja\",F30=\"Ja\"),D30*'Format ark'!D13,0)+IF(AND(D11=\"Ja\",F31=\"Ja\"),D31*'Format ark'!D13,0)+IF(AND(D11=\"Ja\",F32=\"Ja\"),D32*('Format ark'!D13),0)+IF(AND(D11=\"Ja\",F33=\"Ja\"),D33*'Format ark'!D13,0)+IF(AND(D11=\"Ja\",F34=\"Ja\"),D34*'Format ark'!D13,0)+IF(AND(D11=\"Ja\",F35=\"Ja\"),D35*'Format ark'!D13,0)+IF(AND(D11=\"Ja\",F36=\"Ja\"),D36*'Format ark'!D13,0)+IF(AND(D11=\"Ja\",F37=\"Ja\"),D37*'Format ark'!D13,0)+IF(AND(D11=\"Ja\",F38=\"Ja\"),D38*'Format ark'!D13,0)+IF(AND(D11=\"Ja\",F39=\"Ja\"),D39*'Format ark'!D13,0)+IF(AND(D11=\"Ja\",F40=\"Ja\"),D40*'Format ark'!D13,0)","v":0}]
[null,"Samlet deltagerbetaling (udregner selv)",null,{"$f":"SUM(E29:E40)","v":0}]
[]
[null,"Praktik"]
[null,"Navn på virksomhed og p-nummer"]
[null,"Medarbejderens timeforbrug",null,null,{"$f":"IF(D48>C51*0.5,\"Praktik må maksimalt udgøre 50% af det samlede tidsforbrug.\",\" \")","v":" "}]
[null,"Samlet lønkompensation for praktikopholdet",null,{"$f":"IF(D48>C51*0.5,\"IKKE MULIGT\",D48*(IF(D8>261,260,D8)))","v":0}]
[]
[null,"Samlet tidsforbrug ",{"$f":"IF(D48+D41+D23>300,\"IKKE MULIGT\",D48+D41+D23)","v":0},{"$f":"IF(C51>300,\"Det maksimale tidsforbrug er 300 timer\",\" \")","v":" "}]
[]
[null,"Tidsforbrug til administration","Antal timer","Beløb"]
[null,"Der kan godtgøres op til 5 timer.",null,{"$f":"IF(C54>5,\"Der kan maksimalt godtgøres 5 timer pr. medarbejder.\",C54*260)","v":0}]
[]
[null,"Samlet tilsagnsramme i kr. (maksimal støtte til sporskiftepakken): ",null,{"$f":"IF(C51>300,0,MIN(D49+D44+D42+D26+D24+D54,120000))","v":0},{"$f":"IF(D56=120000,\"Det maksimale tilsagn pr. sporskiftepakke er nået, og det overstigende beløb er derfor selvbetaling.\",\"\")","v":""}]
[]
[]
[null,"Estimeret VEU-godtgørelse",null,{"$f":"D43+D25","v":0}]
[]
[null,"Selvbetaling i kr. (udgifter udover den øvre tilsagnsramme)",null,{"$f":"IF(C51>300,0,IF(D56=120000,D44+D26+D42+D49+D24+D54-120000,0))","v":0}]

{"sheet":"Budget","index":31,"n_rows":21,"n_cols":10,"rows_kept":21,"cut":false,"hidden":true,"merged":[[19,1,19,2],[0,4,1,5],[17,1,17,2]]}
[{"$f":"SUM(I9:I11)","v":0},null,null,null,"Budget for sporskiftepakken"]
[{"$f":"I11","v":0}]
[{"$f":"LEN(C5)","v":1}]
[{"$f":"LEN(C6)","v":1},"Virksomhedsnavn"]
[null,"P-nummer",{"$f":"Vejledning!P19","v":0}]
[null,"CVR-nummer",{"$f":"Vejledning!P15","v":0}]
[]
[null,"Medarbejdere","Berretiget til VEU-godtgørelse","Medarbejderens lønkompensation fra sporskifte (kr./t.)","Samlede udgifter brugt på afklaring, vejledning og erhvervsrettet efteruddannelse","Deltagerbetaling alle kurser *","Samlede udgifter brugt til praktikophold","Administrationsbidrag","Samlede udgifter "]
[null,"Medarbejder 1",{"$f":"'Medarbejder 1'!D11","v":"Ja"},{"$f":"'Medarbejder 1'!D7","v":0},{"$f":"'Medarbejder 1'!D24+'Medarbejder 1'!D42","v":0},{"$f":"'Medarbejder 1'!D26+'Medarbejder 1'!D44","v":0},{"$f":"'Medarbejder 1'!D49","v":0},{"$f":"'Medarbejder 1'!D54","v":0},{"$f":"MIN(H9+G9+F9+E9,120000)","v":0}]
[]
[null,"Revision",null,null,null,null,null,null,{"$f":"IF(SUM(I9:I10)>500000,25000,0)","v":0},{"$f":"IF(I13>500000,\"Da det samlede tilsagn overstiger 500.000 kr. er der tilføjet revision.\",\" \")","v":" "}]
[]
[null,"Samlet støttebeløb",null,null,null,null,null,null,{"$f":"SUM(I9:I12)","v":0}]
[]
[null,"*Hvis der er tale om AMU-kurser, behøver STAR ikke at godkende kurset. Ved alle andre former for kurser eller efterudannelse"]
[null,"skal der indsendes bilag med oplysning om kursets indhold, kursusudbyder, pris mm."]
[]
[null,"Estimeret VEU-godtgørelse",null,{"$f":"'Medarbejder 1'!D59","v":0},null,null,null,null,null,{"$f":"'Medarbejder 1'!J59+'Medarbejder 2'!J59+'Medarbejder 3'!J59+'Medarbejder 4'!J59+'Medarbejder 5'!J59+'Medarbejder 6'!J59","v":0}]
[]
[null,"Samlet selvbetaling i kr. (udgifter udover den øvre tilsagnsramme)",null,{"$f":"'Medarbejder 1'!D61","v":0}]
[" "]

{"sheet":"Format ark","index":32,"n_rows":13,"n_cols":4,"rows_kept":13,"cut":false,"hidden":true,"merged":[]}
[]
[null,null,"Grundskole uddannelse","Ja"]
[null,null,"Erhvervsfaglig uddannelse","Nej"]
[null,null,"Gymnasial uddannelse"]
[null,null,"Videregående uddannelse"]
[]
[null,null,"Alle ark er beskyttet ved hjælp af kode: STAR"]
[null,null,"Dette er med store bogstaver og bør indtastes i alle ark for at fjerne denne beskyttelse"]
[null,null,"Budgetarket er dog som det eneste beskyttet med kode \"TOK\""]
[null,null,"Dette skyldes at denne kode er synlig i VBA-koden."]
[]
[]
[null,null,"VEU godtgørelse",{"$f":"IF(Vejledning!P25=2018,116,IF(Vejledning!P25=2019,117.7,IF(Vejledning!P25=2020,119.05,IF(Vejledning!P25=2021,120.54,IF(Vejledning!P25=2022,120.68,0)))))","v":120.68}]

{"sheet":"Slutregnskab","index":33,"n_rows":43,"n_cols":11,"rows_kept":43,"cut":false,"hidden":true,"merged":[[0,4,1,5],[3,8,3,9]]}
[{"$f":"SUM(I10:I11)","v":0},null,null,null,"Slutregnskab for sporskiftepakken"]
[{"$f":"I11","v":0}]
[{"$f":"LEN(C5)","v":1}]
[{"$f":"LEN(C6)","v":1},"Virksomhedsnavn",null,null,null,null,null,null,"Projekt periode"]
[null,"P-nummer",{"$f":"Vejledning!P19","v":0},null,null,null,null,null,"Fra:",null,{"$f":"IF(J5=\"\",\"Husk at indsætte startdato\",\"\")","v":"Husk at indsætte startdato"}]
[null,"CVR-nummer",{"$f":"Vejledning!P15","v":0},null,null,null,null,null,"Til:",null,{"$f":"IF(J6=\"\",\"Husk at indsætte slutdato\",\"\")","v":"Husk at indsætte slutdato"}]
[]
[null,"Medarbejdere","Berretiget til VEU-godtgørelse","Medarbejderens lønkompensation fra sporskifte (kr./t.)","Samlede udgifter brugt på afklaring, vejledning og erhvervsrettet efteruddannelse","Deltagerbetaling alle kurser","Samlede udgifter brugt til praktikophold","Administrationsbidrag","Samlede udgifter ","Tilsagnsbeløb*"]
[null,"Medarbejder 1",{"$f":"'Medarbejder 1'!D11","v":"Ja"},{"$f":"'Medarbejder 1'!D7","v":0},{"$f":"'Medarbejder 1'!D24+'Medarbejder 1'!D42","v":0},{"$f":"'Medarbejder 1'!D26+'Medarbejder 1'!D44","v":0},{"$f":"'Medarbejder 1'!D49","v":0},{"$f":"'Medarbejder 1'!D54","v":0},{"$f":"MIN(H9+G9+F9+E9,120000)","v":0}]
[]
[null,"Revision",null,null,null,null,null,null,null,null,{"$f":"IF(AND(I13>500000,I11=0),\"Da det samlede regnskab overstiger 500.000 kr. skal der tilføjes revision\",\"\")","v":""}]
[null,"Justeret for VEU",null,null,null,null,null,null,{"$f":"D18-D16","v":0}]
[null,"Samlet støttebeløb",null,null,null,null,null,null,{"$f":"SUM(I9:I12)","v":0},{"$f":"SUM(J9:J12)","v":0}]
[null,"* Her angives det ansøgte beløb"]
[]
[null,"Realiseret VEU-godtgørelse*",null,null,{"$f":"IF(D16=\"\",\"Husk at indsætte beløb\",\"\")","v":"Husk at indsætte beløb"}]
[]
[null,"Estimeret VEU-godtgørelse:",null,{"$f":"'Medarbejder 1'!D59","v":0},null,null,null,null,null,{"$f":"'Medarbejder 1'!J59+'Medarbejder 2'!J59+'Medarbejder 3'!J59+'Medarbejder 4'!J59+'Medarbejder 5'!J59+'Medarbejder 6'!J59","v":0}]
[]
[null,"Samlet selvbetaling i kr. (udgifter udover den øvre tilsagnsramme)",null,{"$f":"'Medarbejder 1'!D61","v":0},{"$f":"IF(D20=\"\",\"Husk at indsætte beløb\",\"\")","v":""}]
[null,"*Det bemærkes, at VEU-godtgørelsen er baseret på dagpengesatsen og derfor kan varierer fra år til år."]
[null,"I 2018 var satsen 116 kr/t. og i 2019 er satsen 117,7 kr/t"]
[]
[null,null,null,null,"Ledelseserklæring"]
[null,"Ledelseserklæringen knytter sig til det endelige projektregnskab og er underskrevet af den økonomisk ansvarlige i den tilskudsansvarlige organisation. "]
[]
[null,"Ved krav om revisorpåtegning af regnskabet er erklæringen underskrevet af den projektansvarlige / den økonomisk ansvarlige i den tilskudsansvarlige organisation."]
[]
[null,"Efter projektets bedste overbevisning bekræfter undertegnede hermed følgende forhold:"]
[]
[null,"1) At tilskuddet er anvendt til formålet og de poster, som fremgår af regnskabet"]
[null,"2) At samtlige transaktioner, herunder alle indtægter og omkostninger for projektet, er medtaget i projektregnskabet. "]
[null,"3) At budget og regskab er periodiseret korrekt"]
[null,"4) At projektet er afsluttet og at udgifterne er afholdt i den periode, der fremgår af regnskabet."]
[null,"5) At tilskudsbetingelserne og forudsætningerne for tilskuddet er overholdt"]
[null,"6) At der er taget økonomiske hensyn ved projektets gennemførelse"]
[null,"7) At projektet har oplyst om formodede og konstaterede besvigelser"]
[]
[]
[null,"Navn på projektansvarlig"]
[]
[]
[null,"Underskrift (projektansvarlig)",null,null,null,null,"Dato"]